<< index

Autobuilder log for tags/8.20210621~2 (17170cddcc82136faa3d06cb7048cd124630227d):

>>> Starting at: Mon Jun 21 21:03:32 BST 2021

>>> Commit: 17170cddcc82136faa3d06cb7048cd124630227d

>>> Switching git branch...
--START-IGNORE-WARNINGS
HEAD is now at 4b1b9d7a8 Added annex.freezecontent-command and annex.thawcontent-command configs
Previous HEAD position was 4b1b9d7a8 Added annex.freezecontent-command and annex.thawcontent-command configs
HEAD is now at 17170cddc Merge branch 'master' of ssh://git-annex.branchable.com
HEAD is now at 17170cddc Merge branch 'master' of ssh://git-annex.branchable.com
--STOP-IGNORE-WARNINGS

>>> Cleaning...

>>> Building...
+ unset GIT_ANNEX_TMP_BUILD_DIR
+ unset GIT_ANNEX_LOCAL_FEATURES
++ git rev-parse HEAD
+ REV=17170cddcc82136faa3d06cb7048cd124630227d
+ OUTDIR=../out/output/sha1/17170cddcc82136faa3d06cb7048cd124630227d
+ OUTDIR_TMP=../out/output/sha1/17170cddcc82136faa3d06cb7048cd124630227d.tmp
+ install -d -m0755 -- ../out/output/sha1/17170cddcc82136faa3d06cb7048cd124630227d.tmp
+ printf '%s\n' 17170cddcc82136faa3d06cb7048cd124630227d
+ ghc --make Build/BuildVersion
Linking Build/BuildVersion ...
+ Build/BuildVersion
+ timeout 60m make linuxstandalone
/bin/make git-annex Build/Standalone
make[1]: Entering directory '/home/builder/gitbuilder/build'
cabal build
Resolving dependencies...
Build profile: -w ghc-8.8.4 -O1
In order, the following will be built (use -v for more details):
- git-annex-8.20210428 (exe:git-annex) (file Annex/Drop.hs changed)
Linking /home/builder/gitbuilder/build/dist-newstyle/build/aarch64-linux/ghc-8.8.4/git-annex-8.20210428/setup/setup ...
./git-annex.cabal has been changed. Re-configuring with most recently used
options. If this fails, please run configure manually.
checking UPGRADE_LOCATION... https://downloads.kitenet.net/git-annex/linux/current/git-annex-standalone-arm64.tar.gz
checking git... yes
checking git version... 2.29.2
checking cp -a... yes
checking cp -p... yes
checking cp --preserve=timestamps... yes
checking cp --reflink=auto... yes
checking xargs -0... yes
checking rsync... yes
checking curl... yes
checking bup... no
checking nice... yes
checking ionice... yes
checking nocache... no
checking gpg... gpg
checking lsof... lsof
checking git-remote-gcrypt... git-remote-gcrypt
checking ssh connection caching... yes
Configuring git-annex-8.20210428...
Preprocessing executable 'git-annex' for git-annex-8.20210428..
Building executable 'git-annex' for git-annex-8.20210428..
[ 6 of 669] Compiling BuildInfo ( BuildInfo.hs, /home/builder/gitbuilder/build/dist-newstyle/build/aarch64-linux/ghc-8.8.4/git-annex-8.20210428/build/git-annex/git-annex-tmp/BuildInfo.o ) [Build/Version changed]
[224 of 669] Compiling Types.GitConfig ( Types/GitConfig.hs, /home/builder/gitbuilder/build/dist-newstyle/build/aarch64-linux/ghc-8.8.4/git-annex-8.20210428/build/git-annex/git-annex-tmp/Types/GitConfig.o )
[304 of 669] Compiling Annex.Url ( Annex/Url.hs, /home/builder/gitbuilder/build/dist-newstyle/build/aarch64-linux/ghc-8.8.4/git-annex-8.20210428/build/git-annex/git-annex-tmp/Annex/Url.o ) [BuildInfo changed]
[307 of 669] Compiling Annex.Perms ( Annex/Perms.hs, /home/builder/gitbuilder/build/dist-newstyle/build/aarch64-linux/ghc-8.8.4/git-annex-8.20210428/build/git-annex/git-annex-tmp/Annex/Perms.o )
[317 of 669] Compiling Database.Fsck ( Database/Fsck.hs, /home/builder/gitbuilder/build/dist-newstyle/build/aarch64-linux/ghc-8.8.4/git-annex-8.20210428/build/git-annex/git-annex-tmp/Database/Fsck.o ) [TH]
qemu: Unsupported syscall: 241
[350 of 669] Compiling P2P.Protocol ( P2P/Protocol.hs, /home/builder/gitbuilder/build/dist-newstyle/build/aarch64-linux/ghc-8.8.4/git-annex-8.20210428/build/git-annex/git-annex-tmp/P2P/Protocol.o ) [TH]
[381 of 669] Compiling Database.Export ( Database/Export.hs, /home/builder/gitbuilder/build/dist-newstyle/build/aarch64-linux/ghc-8.8.4/git-annex-8.20210428/build/git-annex/git-annex-tmp/Database/Export.o ) [TH]
[391 of 669] Compiling Database.ContentIdentifier ( Database/ContentIdentifier.hs, /home/builder/gitbuilder/build/dist-newstyle/build/aarch64-linux/ghc-8.8.4/git-annex-8.20210428/build/git-annex/git-annex-tmp/Database/ContentIdentifier.o ) [TH]
[440 of 669] Compiling Annex.Init ( Annex/Init.hs, /home/builder/gitbuilder/build/dist-newstyle/build/aarch64-linux/ghc-8.8.4/git-annex-8.20210428/build/git-annex/git-annex-tmp/Annex/Init.o )
[465 of 669] Compiling Command.Version ( Command/Version.hs, /home/builder/gitbuilder/build/dist-newstyle/build/aarch64-linux/ghc-8.8.4/git-annex-8.20210428/build/git-annex/git-annex-tmp/Command/Version.o ) [BuildInfo changed]
[570 of 669] Compiling Annex.Drop ( Annex/Drop.hs, /home/builder/gitbuilder/build/dist-newstyle/build/aarch64-linux/ghc-8.8.4/git-annex-8.20210428/build/git-annex/git-annex-tmp/Annex/Drop.o )

The qualified import of `Annex' is redundant
except perhaps to import instances from `Annex'
To import instances alone, use: import Annex()
|
13 | import qualified Annex
| ^^^^^^^^^^^^^^^^^^^^^^
[571 of 669] Compiling Command.Sync ( Command/Sync.hs, /home/builder/gitbuilder/build/dist-newstyle/build/aarch64-linux/ghc-8.8.4/git-annex-8.20210428/build/git-annex/git-annex-tmp/Command/Sync.o )
llc-9: builderMainLoop: fork: resource exhausted (Cannot allocate memory)
make[1]: *** [Makefile:58: git-annex] Error 1
make[1]: Leaving directory '/home/builder/gitbuilder/build'
+ timeout 360m make linuxstandalone
/bin/make git-annex Build/Standalone
make[1]: Entering directory '/home/builder/gitbuilder/build'
if [ "cabal" = ./Setup ]; then ghc --make Setup; fi
if [ "cabal" != stack ]; then \
cabal configure --ghc-options=""; \
else \
cabal setup ; \
fi
'cabal.project.local' file already exists. Now overwriting it.
Build profile: -w ghc-8.8.4 -O1
In order, the following would be built (use -v for more details):
- git-annex-8.20210428 (file Annex/Drop.hs changed)
mkdir -p tmp
touch tmp/configure-stamp
cabal build
Build profile: -w ghc-8.8.4 -O1
In order, the following will be built (use -v for more details):
- git-annex-8.20210428 (exe:git-annex) (file Annex/Drop.hs changed)
Linking /home/builder/gitbuilder/build/dist-newstyle/build/aarch64-linux/ghc-8.8.4/git-annex-8.20210428/setup/setup ...
Preprocessing executable 'git-annex' for git-annex-8.20210428..
Building executable 'git-annex' for git-annex-8.20210428..
[605 of 669] Compiling Assistant.WebApp.Types ( Assistant/WebApp/Types.hs, /home/builder/gitbuilder/build/dist-newstyle/build/aarch64-linux/ghc-8.8.4/git-annex-8.20210428/build/git-annex/git-annex-tmp/Assistant/WebApp/Types.o ) [BuildInfo changed]
qemu: Unsupported syscall: 241
[612 of 669] Compiling Assistant.WebApp.Documentation ( Assistant/WebApp/Documentation.hs, /home/builder/gitbuilder/build/dist-newstyle/build/aarch64-linux/ghc-8.8.4/git-annex-8.20210428/build/git-annex/git-annex-tmp/Assistant/WebApp/Documentation.o ) [BuildInfo changed]
[623 of 669] Compiling Assistant.Threads.Committer ( Assistant/Threads/Committer.hs, /home/builder/gitbuilder/build/dist-newstyle/build/aarch64-linux/ghc-8.8.4/git-annex-8.20210428/build/git-annex/git-annex-tmp/Assistant/Threads/Committer.o ) [Command.Sync changed]
[652 of 669] Compiling Assistant.Threads.Upgrader ( Assistant/Threads/Upgrader.hs, /home/builder/gitbuilder/build/dist-newstyle/build/aarch64-linux/ghc-8.8.4/git-annex-8.20210428/build/git-annex/git-annex-tmp/Assistant/Threads/Upgrader.o ) [BuildInfo changed]
[653 of 669] Compiling Assistant.Threads.UpgradeWatcher ( Assistant/Threads/UpgradeWatcher.hs, /home/builder/gitbuilder/build/dist-newstyle/build/aarch64-linux/ghc-8.8.4/git-annex-8.20210428/build/git-annex/git-annex-tmp/Assistant/Threads/UpgradeWatcher.o ) [BuildInfo changed]
[661 of 669] Compiling Assistant.Threads.WebApp ( Assistant/Threads/WebApp.hs, /home/builder/gitbuilder/build/dist-newstyle/build/aarch64-linux/ghc-8.8.4/git-annex-8.20210428/build/git-annex/git-annex-tmp/Assistant/Threads/WebApp.o ) [Assistant.WebApp.Documentation changed]
llc-9: builderMainLoop: fork: resource exhausted (Cannot allocate memory)
make[1]: *** [Makefile:58: git-annex] Error 1
make[1]: Leaving directory '/home/builder/gitbuilder/build'
+ timeout 360m make linuxstandalone
/bin/make git-annex Build/Standalone
make[1]: Entering directory '/home/builder/gitbuilder/build'
cabal build
Build profile: -w ghc-8.8.4 -O1
In order, the following will be built (use -v for more details):
- git-annex-8.20210428 (exe:git-annex) (file Annex/Drop.hs changed)
Linking /home/builder/gitbuilder/build/dist-newstyle/build/aarch64-linux/ghc-8.8.4/git-annex-8.20210428/setup/setup ...
Preprocessing executable 'git-annex' for git-annex-8.20210428..
Building executable 'git-annex' for git-annex-8.20210428..
[667 of 669] Compiling CmdLine.GitAnnex ( CmdLine/GitAnnex.hs, /home/builder/gitbuilder/build/dist-newstyle/build/aarch64-linux/ghc-8.8.4/git-annex-8.20210428/build/git-annex/git-annex-tmp/CmdLine/GitAnnex.o ) [Command.Version changed]
[668 of 669] Compiling Test ( Test.hs, /home/builder/gitbuilder/build/dist-newstyle/build/aarch64-linux/ghc-8.8.4/git-annex-8.20210428/build/git-annex/git-annex-tmp/Test.o )
llc-9: builderMainLoop: fork: resource exhausted (Cannot allocate memory)
make[1]: *** [Makefile:58: git-annex] Error 1
make[1]: Leaving directory '/home/builder/gitbuilder/build'
+ timeout 360m make linuxstandalone
/bin/make git-annex Build/Standalone
make[1]: Entering directory '/home/builder/gitbuilder/build'
cabal build
Build profile: -w ghc-8.8.4 -O1
In order, the following will be built (use -v for more details):
- git-annex-8.20210428 (exe:git-annex) (file Annex/Drop.hs changed)
Linking /home/builder/gitbuilder/build/dist-newstyle/build/aarch64-linux/ghc-8.8.4/git-annex-8.20210428/setup/setup ...
Preprocessing executable 'git-annex' for git-annex-8.20210428..
Building executable 'git-annex' for git-annex-8.20210428..
[668 of 669] Compiling Test ( Test.hs, /home/builder/gitbuilder/build/dist-newstyle/build/aarch64-linux/ghc-8.8.4/git-annex-8.20210428/build/git-annex/git-annex-tmp/Test.o )
llc-9: builderMainLoop: fork: resource exhausted (Cannot allocate memory)
make[1]: *** [Makefile:58: git-annex] Error 1
make[1]: Leaving directory '/home/builder/gitbuilder/build'
+ exit 3

>>> Result code: 40
FAIL
renamed 'out/log' -> 'out/fail/17170cddcc82136faa3d06cb7048cd124630227d'
Done: 17170cddcc82136faa3d06cb7048cd124630227d