<< index

Autobuilder log for tags/8.20210903~133 (1a48d51e5bc2957bd72ab29cb8ed141777c98257):

>>> Starting at: Tue Aug 3 23:04:00 BST 2021

>>> Commit: 1a48d51e5bc2957bd72ab29cb8ed141777c98257

>>> Switching git branch...
--START-IGNORE-WARNINGS
HEAD is now at b28fb4305 Added a comment
Previous HEAD position was b28fb4305 Added a comment
HEAD is now at 1a48d51e5 devblog
HEAD is now at 1a48d51e5 devblog
--STOP-IGNORE-WARNINGS

>>> Cleaning...

>>> Building...
+ unset GIT_ANNEX_TMP_BUILD_DIR
+ unset GIT_ANNEX_LOCAL_FEATURES
++ git rev-parse HEAD
+ REV=1a48d51e5bc2957bd72ab29cb8ed141777c98257
+ OUTDIR=../out/output/sha1/1a48d51e5bc2957bd72ab29cb8ed141777c98257
+ OUTDIR_TMP=../out/output/sha1/1a48d51e5bc2957bd72ab29cb8ed141777c98257.tmp
+ install -d -m0755 -- ../out/output/sha1/1a48d51e5bc2957bd72ab29cb8ed141777c98257.tmp
+ printf '%s\n' 1a48d51e5bc2957bd72ab29cb8ed141777c98257
+ ghc --make Build/BuildVersion
Linking Build/BuildVersion ...
+ Build/BuildVersion
+ timeout 60m make linuxstandalone
/bin/make git-annex Build/Standalone
make[1]: Entering directory '/home/builder/gitbuilder/build'
cabal build
Resolving dependencies...
Build profile: -w ghc-8.8.4 -O1
In order, the following will be built (use -v for more details):
- git-annex-8.20210803 (exe:git-annex) (first run)
Linking /home/builder/gitbuilder/build/dist-newstyle/build/aarch64-linux/ghc-8.8.4/git-annex-8.20210803/setup/setup ...
Preprocessing executable 'git-annex' for git-annex-8.20210803..
Building executable 'git-annex' for git-annex-8.20210803..
[ 6 of 671] Compiling BuildInfo ( BuildInfo.hs, /home/builder/gitbuilder/build/dist-newstyle/build/aarch64-linux/ghc-8.8.4/git-annex-8.20210803/build/git-annex/git-annex-tmp/BuildInfo.o ) [Build/Version changed]
[161 of 671] Compiling Git.Url ( Git/Url.hs, /home/builder/gitbuilder/build/dist-newstyle/build/aarch64-linux/ghc-8.8.4/git-annex-8.20210803/build/git-annex/git-annex-tmp/Git/Url.o )
[162 of 671] Compiling Git.Ssh ( Git/Ssh.hs, /home/builder/gitbuilder/build/dist-newstyle/build/aarch64-linux/ghc-8.8.4/git-annex-8.20210803/build/git-annex/git-annex-tmp/Git/Ssh.o )
[163 of 671] Compiling Git.Sha ( Git/Sha.hs, /home/builder/gitbuilder/build/dist-newstyle/build/aarch64-linux/ghc-8.8.4/git-annex-8.20210803/build/git-annex/git-annex-tmp/Git/Sha.o )
[164 of 671] Compiling Git.LockFile ( Git/LockFile.hs, /home/builder/gitbuilder/build/dist-newstyle/build/aarch64-linux/ghc-8.8.4/git-annex-8.20210803/build/git-annex/git-annex-tmp/Git/LockFile.o )
[165 of 671] Compiling Git.Filename ( Git/Filename.hs, /home/builder/gitbuilder/build/dist-newstyle/build/aarch64-linux/ghc-8.8.4/git-annex-8.20210803/build/git-annex/git-annex-tmp/Git/Filename.o )
[166 of 671] Compiling Git ( Git.hs, /home/builder/gitbuilder/build/dist-newstyle/build/aarch64-linux/ghc-8.8.4/git-annex-8.20210803/build/git-annex/git-annex-tmp/Git.o )
[167 of 671] Compiling Git.Remote ( Git/Remote.hs, /home/builder/gitbuilder/build/dist-newstyle/build/aarch64-linux/ghc-8.8.4/git-annex-8.20210803/build/git-annex/git-annex-tmp/Git/Remote.o )
[168 of 671] Compiling Git.Objects ( Git/Objects.hs, /home/builder/gitbuilder/build/dist-newstyle/build/aarch64-linux/ghc-8.8.4/git-annex-8.20210803/build/git-annex/git-annex-tmp/Git/Objects.o )
[169 of 671] Compiling Git.Index ( Git/Index.hs, /home/builder/gitbuilder/build/dist-newstyle/build/aarch64-linux/ghc-8.8.4/git-annex-8.20210803/build/git-annex/git-annex-tmp/Git/Index.o )
[170 of 671] Compiling Git.Hook ( Git/Hook.hs, /home/builder/gitbuilder/build/dist-newstyle/build/aarch64-linux/ghc-8.8.4/git-annex-8.20210803/build/git-annex/git-annex-tmp/Git/Hook.o )
[171 of 671] Compiling Git.FilePath ( Git/FilePath.hs, /home/builder/gitbuilder/build/dist-newstyle/build/aarch64-linux/ghc-8.8.4/git-annex-8.20210803/build/git-annex/git-annex-tmp/Git/FilePath.o )
[172 of 671] Compiling Types.Export ( Types/Export.hs, /home/builder/gitbuilder/build/dist-newstyle/build/aarch64-linux/ghc-8.8.4/git-annex-8.20210803/build/git-annex/git-annex-tmp/Types/Export.o )
[173 of 671] Compiling Types.Import ( Types/Import.hs, /home/builder/gitbuilder/build/dist-newstyle/build/aarch64-linux/ghc-8.8.4/git-annex-8.20210803/build/git-annex/git-annex-tmp/Types/Import.o )
[174 of 671] Compiling Database.Types ( Database/Types.hs, /home/builder/gitbuilder/build/dist-newstyle/build/aarch64-linux/ghc-8.8.4/git-annex-8.20210803/build/git-annex/git-annex-tmp/Database/Types.o )
[175 of 671] Compiling Git.DiffTreeItem ( Git/DiffTreeItem.hs, /home/builder/gitbuilder/build/dist-newstyle/build/aarch64-linux/ghc-8.8.4/git-annex-8.20210803/build/git-annex/git-annex-tmp/Git/DiffTreeItem.o )
[176 of 671] Compiling Database.Keys.SQL ( Database/Keys/SQL.hs, /home/builder/gitbuilder/build/dist-newstyle/build/aarch64-linux/ghc-8.8.4/git-annex-8.20210803/build/git-annex/git-annex-tmp/Database/Keys/SQL.o )
qemu: Unsupported syscall: 241
cannot find object file `/home/builder/gitbuilder/build/dist-newstyle/build/aarch64-linux/ghc-8.8.4/git-annex-8.20210803/build/git-annex/git-annex-tmp/Types/Key.dyn_o'
while linking an interpreted expression
make[1]: *** [Makefile:58: git-annex] Error 1
make[1]: Leaving directory '/home/builder/gitbuilder/build'
+ timeout 360m make linuxstandalone
/bin/make git-annex Build/Standalone
make[1]: Entering directory '/home/builder/gitbuilder/build'
cabal build
Build profile: -w ghc-8.8.4 -O1
In order, the following will be built (use -v for more details):
- git-annex-8.20210803 (exe:git-annex) (first run)
Linking /home/builder/gitbuilder/build/dist-newstyle/build/aarch64-linux/ghc-8.8.4/git-annex-8.20210803/setup/setup ...
Preprocessing executable 'git-annex' for git-annex-8.20210803..
Building executable 'git-annex' for git-annex-8.20210803..
[176 of 671] Compiling Database.Keys.SQL ( Database/Keys/SQL.hs, /home/builder/gitbuilder/build/dist-newstyle/build/aarch64-linux/ghc-8.8.4/git-annex-8.20210803/build/git-annex/git-annex-tmp/Database/Keys/SQL.o )
qemu: Unsupported syscall: 241
cannot find object file `/home/builder/gitbuilder/build/dist-newstyle/build/aarch64-linux/ghc-8.8.4/git-annex-8.20210803/build/git-annex/git-annex-tmp/Types/Key.dyn_o'
while linking an interpreted expression
make[1]: *** [Makefile:58: git-annex] Error 1
make[1]: Leaving directory '/home/builder/gitbuilder/build'
+ timeout 360m make linuxstandalone
/bin/make git-annex Build/Standalone
make[1]: Entering directory '/home/builder/gitbuilder/build'
cabal build
Build profile: -w ghc-8.8.4 -O1
In order, the following will be built (use -v for more details):
- git-annex-8.20210803 (exe:git-annex) (first run)
Linking /home/builder/gitbuilder/build/dist-newstyle/build/aarch64-linux/ghc-8.8.4/git-annex-8.20210803/setup/setup ...
Preprocessing executable 'git-annex' for git-annex-8.20210803..
Building executable 'git-annex' for git-annex-8.20210803..
[176 of 671] Compiling Database.Keys.SQL ( Database/Keys/SQL.hs, /home/builder/gitbuilder/build/dist-newstyle/build/aarch64-linux/ghc-8.8.4/git-annex-8.20210803/build/git-annex/git-annex-tmp/Database/Keys/SQL.o )
qemu: Unsupported syscall: 241
cannot find object file `/home/builder/gitbuilder/build/dist-newstyle/build/aarch64-linux/ghc-8.8.4/git-annex-8.20210803/build/git-annex/git-annex-tmp/Types/Key.dyn_o'
while linking an interpreted expression
make[1]: *** [Makefile:58: git-annex] Error 1
make[1]: Leaving directory '/home/builder/gitbuilder/build'
+ timeout 360m make linuxstandalone
/bin/make git-annex Build/Standalone
make[1]: Entering directory '/home/builder/gitbuilder/build'
cabal build
Build profile: -w ghc-8.8.4 -O1
In order, the following will be built (use -v for more details):
- git-annex-8.20210803 (exe:git-annex) (first run)
Linking /home/builder/gitbuilder/build/dist-newstyle/build/aarch64-linux/ghc-8.8.4/git-annex-8.20210803/setup/setup ...
Preprocessing executable 'git-annex' for git-annex-8.20210803..
Building executable 'git-annex' for git-annex-8.20210803..
[176 of 671] Compiling Database.Keys.SQL ( Database/Keys/SQL.hs, /home/builder/gitbuilder/build/dist-newstyle/build/aarch64-linux/ghc-8.8.4/git-annex-8.20210803/build/git-annex/git-annex-tmp/Database/Keys/SQL.o )
qemu: Unsupported syscall: 241
cannot find object file `/home/builder/gitbuilder/build/dist-newstyle/build/aarch64-linux/ghc-8.8.4/git-annex-8.20210803/build/git-annex/git-annex-tmp/Types/Key.dyn_o'
while linking an interpreted expression
make[1]: *** [Makefile:58: git-annex] Error 1
make[1]: Leaving directory '/home/builder/gitbuilder/build'
+ exit 3

>>> Result code: 40
FAIL
renamed 'out/log' -> 'out/fail/1a48d51e5bc2957bd72ab29cb8ed141777c98257'
Done: 1a48d51e5bc2957bd72ab29cb8ed141777c98257