<< index

Autobuilder log for tags/8.20210714~24 (215aee105d20f1bcd6297e7e7bd18083e4ff2181):

>>> Starting at: Mon Jul 12 15:01:27 BST 2021

>>> Commit: 215aee105d20f1bcd6297e7e7bd18083e4ff2181

>>> Switching git branch...
--START-IGNORE-WARNINGS
HEAD is now at e85eed583 Added a comment
Previous HEAD position was e85eed583 Added a comment
HEAD is now at 215aee105 commet
HEAD is now at 215aee105 commet
--STOP-IGNORE-WARNINGS

>>> Cleaning...

>>> Building...
+ unset GIT_ANNEX_TMP_BUILD_DIR
+ unset GIT_ANNEX_LOCAL_FEATURES
++ git rev-parse HEAD
+ REV=215aee105d20f1bcd6297e7e7bd18083e4ff2181
+ OUTDIR=../out/output/sha1/215aee105d20f1bcd6297e7e7bd18083e4ff2181
+ OUTDIR_TMP=../out/output/sha1/215aee105d20f1bcd6297e7e7bd18083e4ff2181.tmp
+ install -d -m0755 -- ../out/output/sha1/215aee105d20f1bcd6297e7e7bd18083e4ff2181.tmp
+ printf '%s\n' 215aee105d20f1bcd6297e7e7bd18083e4ff2181
+ ghc --make Build/BuildVersion
Linking Build/BuildVersion ...
+ Build/BuildVersion
+ timeout 60m make linuxstandalone
/bin/make git-annex Build/Standalone
make[1]: Entering directory '/home/builder/gitbuilder/build'
cabal build
Resolving dependencies...
Build profile: -w ghc-8.8.4 -O1
In order, the following will be built (use -v for more details):
- git-annex-8.20210630 (exe:git-annex) (first run)
Linking /home/builder/gitbuilder/build/dist-newstyle/build/aarch64-linux/ghc-8.8.4/git-annex-8.20210630/setup/setup ...
Preprocessing executable 'git-annex' for git-annex-8.20210630..
Building executable 'git-annex' for git-annex-8.20210630..
[ 6 of 669] Compiling BuildInfo ( BuildInfo.hs, /home/builder/gitbuilder/build/dist-newstyle/build/aarch64-linux/ghc-8.8.4/git-annex-8.20210630/build/git-annex/git-annex-tmp/BuildInfo.o ) [Build/Version changed]
[176 of 669] Compiling Database.Keys.SQL ( Database/Keys/SQL.hs, /home/builder/gitbuilder/build/dist-newstyle/build/aarch64-linux/ghc-8.8.4/git-annex-8.20210630/build/git-annex/git-annex-tmp/Database/Keys/SQL.o )
qemu: Unsupported syscall: 241
cannot find object file `/home/builder/gitbuilder/build/dist-newstyle/build/aarch64-linux/ghc-8.8.4/git-annex-8.20210630/build/git-annex/git-annex-tmp/Utility/Path.dyn_o'
while linking an interpreted expression
make[1]: *** [Makefile:58: git-annex] Error 1
make[1]: Leaving directory '/home/builder/gitbuilder/build'
+ timeout 360m make linuxstandalone
/bin/make git-annex Build/Standalone
make[1]: Entering directory '/home/builder/gitbuilder/build'
cabal build
Resolving dependencies...
Build profile: -w ghc-8.8.4 -O1
In order, the following will be built (use -v for more details):
- git-annex-8.20210630 (exe:git-annex) (first run)
Linking /home/builder/gitbuilder/build/dist-newstyle/build/aarch64-linux/ghc-8.8.4/git-annex-8.20210630/setup/setup ...
Preprocessing executable 'git-annex' for git-annex-8.20210630..
Building executable 'git-annex' for git-annex-8.20210630..
[176 of 669] Compiling Database.Keys.SQL ( Database/Keys/SQL.hs, /home/builder/gitbuilder/build/dist-newstyle/build/aarch64-linux/ghc-8.8.4/git-annex-8.20210630/build/git-annex/git-annex-tmp/Database/Keys/SQL.o )
qemu: Unsupported syscall: 241
cannot find object file `/home/builder/gitbuilder/build/dist-newstyle/build/aarch64-linux/ghc-8.8.4/git-annex-8.20210630/build/git-annex/git-annex-tmp/Utility/Path.dyn_o'
while linking an interpreted expression
make[1]: *** [Makefile:58: git-annex] Error 1
make[1]: Leaving directory '/home/builder/gitbuilder/build'
+ timeout 360m make linuxstandalone
/bin/make git-annex Build/Standalone
make[1]: Entering directory '/home/builder/gitbuilder/build'
cabal build
Build profile: -w ghc-8.8.4 -O1
In order, the following will be built (use -v for more details):
- git-annex-8.20210630 (exe:git-annex) (first run)
Linking /home/builder/gitbuilder/build/dist-newstyle/build/aarch64-linux/ghc-8.8.4/git-annex-8.20210630/setup/setup ...
Preprocessing executable 'git-annex' for git-annex-8.20210630..
Building executable 'git-annex' for git-annex-8.20210630..
[176 of 669] Compiling Database.Keys.SQL ( Database/Keys/SQL.hs, /home/builder/gitbuilder/build/dist-newstyle/build/aarch64-linux/ghc-8.8.4/git-annex-8.20210630/build/git-annex/git-annex-tmp/Database/Keys/SQL.o )
qemu: Unsupported syscall: 241
cannot find object file `/home/builder/gitbuilder/build/dist-newstyle/build/aarch64-linux/ghc-8.8.4/git-annex-8.20210630/build/git-annex/git-annex-tmp/Utility/Path.dyn_o'
while linking an interpreted expression
make[1]: *** [Makefile:58: git-annex] Error 1
make[1]: Leaving directory '/home/builder/gitbuilder/build'
+ timeout 360m make linuxstandalone
/bin/make git-annex Build/Standalone
make[1]: Entering directory '/home/builder/gitbuilder/build'
cabal build
Build profile: -w ghc-8.8.4 -O1
In order, the following will be built (use -v for more details):
- git-annex-8.20210630 (exe:git-annex) (first run)
Linking /home/builder/gitbuilder/build/dist-newstyle/build/aarch64-linux/ghc-8.8.4/git-annex-8.20210630/setup/setup ...
Preprocessing executable 'git-annex' for git-annex-8.20210630..
Building executable 'git-annex' for git-annex-8.20210630..
[176 of 669] Compiling Database.Keys.SQL ( Database/Keys/SQL.hs, /home/builder/gitbuilder/build/dist-newstyle/build/aarch64-linux/ghc-8.8.4/git-annex-8.20210630/build/git-annex/git-annex-tmp/Database/Keys/SQL.o )
aarch64-linux-gnu-gcc: createProcess: fork: resource exhausted (Cannot allocate memory)
make[1]: *** [Makefile:58: git-annex] Error 1
make[1]: Leaving directory '/home/builder/gitbuilder/build'
+ exit 3

>>> Result code: 40
FAIL
renamed 'out/log' -> 'out/fail/215aee105d20f1bcd6297e7e7bd18083e4ff2181'
Done: 215aee105d20f1bcd6297e7e7bd18083e4ff2181