<< index

Autobuilder log for tags/8.20210803~41 (645b045e02a7c6e3e7d6e9768de9b66cb4da04c8):

>>> Starting at: Thu Jul 22 20:03:40 BST 2021

>>> Commit: 645b045e02a7c6e3e7d6e9768de9b66cb4da04c8

>>> Switching git branch...
--START-IGNORE-WARNINGS
HEAD is now at 801a5ddb9 comment
Previous HEAD position was 801a5ddb9 comment
HEAD is now at 645b045e0 comment
HEAD is now at 645b045e0 comment
--STOP-IGNORE-WARNINGS

>>> Cleaning...

>>> Building...
+ unset GIT_ANNEX_TMP_BUILD_DIR
+ unset GIT_ANNEX_LOCAL_FEATURES
++ git rev-parse HEAD
+ REV=645b045e02a7c6e3e7d6e9768de9b66cb4da04c8
+ OUTDIR=../out/output/sha1/645b045e02a7c6e3e7d6e9768de9b66cb4da04c8
+ OUTDIR_TMP=../out/output/sha1/645b045e02a7c6e3e7d6e9768de9b66cb4da04c8.tmp
+ install -d -m0755 -- ../out/output/sha1/645b045e02a7c6e3e7d6e9768de9b66cb4da04c8.tmp
+ printf '%s\n' 645b045e02a7c6e3e7d6e9768de9b66cb4da04c8
+ ghc --make Build/BuildVersion
Linking Build/BuildVersion ...
+ Build/BuildVersion
+ timeout 60m make linuxstandalone
/bin/make git-annex Build/Standalone
make[1]: Entering directory '/home/builder/gitbuilder/build'
cabal build
Resolving dependencies...
Build profile: -w ghc-8.8.4 -O1
In order, the following will be built (use -v for more details):
- git-annex-8.20210714 (exe:git-annex) (first run)
Linking /home/builder/gitbuilder/build/dist-newstyle/build/aarch64-linux/ghc-8.8.4/git-annex-8.20210714/setup/setup ...
Preprocessing executable 'git-annex' for git-annex-8.20210714..
Building executable 'git-annex' for git-annex-8.20210714..
[ 6 of 670] Compiling BuildInfo ( BuildInfo.hs, /home/builder/gitbuilder/build/dist-newstyle/build/aarch64-linux/ghc-8.8.4/git-annex-8.20210714/build/git-annex/git-annex-tmp/BuildInfo.o ) [Build/Version changed]
[301 of 670] Compiling Annex.Url ( Annex/Url.hs, /home/builder/gitbuilder/build/dist-newstyle/build/aarch64-linux/ghc-8.8.4/git-annex-8.20210714/build/git-annex/git-annex-tmp/Annex/Url.o ) [BuildInfo changed]
[463 of 670] Compiling Command.Version ( Command/Version.hs, /home/builder/gitbuilder/build/dist-newstyle/build/aarch64-linux/ghc-8.8.4/git-annex-8.20210714/build/git-annex/git-annex-tmp/Command/Version.o ) [BuildInfo changed]
[574 of 670] Compiling Command.Sync ( Command/Sync.hs, /home/builder/gitbuilder/build/dist-newstyle/build/aarch64-linux/ghc-8.8.4/git-annex-8.20210714/build/git-annex/git-annex-tmp/Command/Sync.o )
[575 of 670] Compiling Command.Undo ( Command/Undo.hs, /home/builder/gitbuilder/build/dist-newstyle/build/aarch64-linux/ghc-8.8.4/git-annex-8.20210714/build/git-annex/git-annex-tmp/Command/Undo.o ) [Command changed]
[576 of 670] Compiling Command.PostReceive ( Command/PostReceive.hs, /home/builder/gitbuilder/build/dist-newstyle/build/aarch64-linux/ghc-8.8.4/git-annex-8.20210714/build/git-annex/git-annex-tmp/Command/PostReceive.o )
[577 of 670] Compiling Command.Merge ( Command/Merge.hs, /home/builder/gitbuilder/build/dist-newstyle/build/aarch64-linux/ghc-8.8.4/git-annex-8.20210714/build/git-annex/git-annex-tmp/Command/Merge.o )
[578 of 670] Compiling Command.Help ( Command/Help.hs, /home/builder/gitbuilder/build/dist-newstyle/build/aarch64-linux/ghc-8.8.4/git-annex-8.20210714/build/git-annex/git-annex-tmp/Command/Help.o ) [Command changed]
[579 of 670] Compiling Test ( Test.hs, /home/builder/gitbuilder/build/dist-newstyle/build/aarch64-linux/ghc-8.8.4/git-annex-8.20210714/build/git-annex/git-annex-tmp/Test.o )
opt-9: builderMainLoop: fork: resource exhausted (Cannot allocate memory)
make[1]: *** [Makefile:58: git-annex] Error 1
make[1]: Leaving directory '/home/builder/gitbuilder/build'
+ timeout 360m make linuxstandalone
/bin/make git-annex Build/Standalone
make[1]: Entering directory '/home/builder/gitbuilder/build'
cabal build
Build profile: -w ghc-8.8.4 -O1
In order, the following will be built (use -v for more details):
- git-annex-8.20210714 (exe:git-annex) (first run)
Linking /home/builder/gitbuilder/build/dist-newstyle/build/aarch64-linux/ghc-8.8.4/git-annex-8.20210714/setup/setup ...
Preprocessing executable 'git-annex' for git-annex-8.20210714..
Building executable 'git-annex' for git-annex-8.20210714..
[579 of 670] Compiling Test ( Test.hs, /home/builder/gitbuilder/build/dist-newstyle/build/aarch64-linux/ghc-8.8.4/git-annex-8.20210714/build/git-annex/git-annex-tmp/Test.o )
llc-9: builderMainLoop: fork: resource exhausted (Cannot allocate memory)
make[1]: *** [Makefile:58: git-annex] Error 1
make[1]: Leaving directory '/home/builder/gitbuilder/build'
+ timeout 360m make linuxstandalone
/bin/make git-annex Build/Standalone
make[1]: Entering directory '/home/builder/gitbuilder/build'
cabal build
Build profile: -w ghc-8.8.4 -O1
In order, the following will be built (use -v for more details):
- git-annex-8.20210714 (exe:git-annex) (first run)
Linking /home/builder/gitbuilder/build/dist-newstyle/build/aarch64-linux/ghc-8.8.4/git-annex-8.20210714/setup/setup ...
Preprocessing executable 'git-annex' for git-annex-8.20210714..
Building executable 'git-annex' for git-annex-8.20210714..
[579 of 670] Compiling Test ( Test.hs, /home/builder/gitbuilder/build/dist-newstyle/build/aarch64-linux/ghc-8.8.4/git-annex-8.20210714/build/git-annex/git-annex-tmp/Test.o )
llc-9: builderMainLoop: fork: resource exhausted (Cannot allocate memory)
make[1]: *** [Makefile:58: git-annex] Error 1
make[1]: Leaving directory '/home/builder/gitbuilder/build'
+ timeout 360m make linuxstandalone
/bin/make git-annex Build/Standalone
make[1]: Entering directory '/home/builder/gitbuilder/build'
cabal build
Build profile: -w ghc-8.8.4 -O1
In order, the following will be built (use -v for more details):
- git-annex-8.20210714 (exe:git-annex) (first run)
Linking /home/builder/gitbuilder/build/dist-newstyle/build/aarch64-linux/ghc-8.8.4/git-annex-8.20210714/setup/setup ...
Preprocessing executable 'git-annex' for git-annex-8.20210714..
Building executable 'git-annex' for git-annex-8.20210714..
[579 of 670] Compiling Test ( Test.hs, /home/builder/gitbuilder/build/dist-newstyle/build/aarch64-linux/ghc-8.8.4/git-annex-8.20210714/build/git-annex/git-annex-tmp/Test.o )
llc-9: builderMainLoop: fork: resource exhausted (Cannot allocate memory)
make[1]: *** [Makefile:58: git-annex] Error 1
make[1]: Leaving directory '/home/builder/gitbuilder/build'
+ exit 3

>>> Result code: 40
FAIL
renamed 'out/log' -> 'out/fail/645b045e02a7c6e3e7d6e9768de9b66cb4da04c8'
Done: 645b045e02a7c6e3e7d6e9768de9b66cb4da04c8