<< index

Autobuilder log for tags/8.20210903~50 (5a2818f9cf9dbb83fcb287e984e36b2807062f14):

>>> Starting at: Thu Aug 26 18:01:27 BST 2021

>>> Commit: 5a2818f9cf9dbb83fcb287e984e36b2807062f14

>>> Switching git branch...
--START-IGNORE-WARNINGS
HEAD is now at 36ccc4db4 removed
Previous HEAD position was 36ccc4db4 removed
HEAD is now at 5a2818f9c Added a comment
HEAD is now at 5a2818f9c Added a comment
--STOP-IGNORE-WARNINGS

>>> Cleaning...

>>> Building...
+ unset GIT_ANNEX_TMP_BUILD_DIR
+ unset GIT_ANNEX_LOCAL_FEATURES
++ git rev-parse HEAD
+ REV=5a2818f9cf9dbb83fcb287e984e36b2807062f14
+ OUTDIR=../out/output/sha1/5a2818f9cf9dbb83fcb287e984e36b2807062f14
+ OUTDIR_TMP=../out/output/sha1/5a2818f9cf9dbb83fcb287e984e36b2807062f14.tmp
+ install -d -m0755 -- ../out/output/sha1/5a2818f9cf9dbb83fcb287e984e36b2807062f14.tmp
+ printf '%s\n' 5a2818f9cf9dbb83fcb287e984e36b2807062f14
+ ghc --make Build/BuildVersion
Linking Build/BuildVersion ...
+ Build/BuildVersion
+ timeout 60m make linuxstandalone
/bin/make git-annex Build/Standalone
make[1]: Entering directory '/home/builder/gitbuilder/build'
cabal build
Build profile: -w ghc-8.8.4 -O1
In order, the following will be built (use -v for more details):
- git-annex-8.20210803 (exe:git-annex) (first run)
Linking /home/builder/gitbuilder/build/dist-newstyle/build/aarch64-linux/ghc-8.8.4/git-annex-8.20210803/setup/setup ...
Preprocessing executable 'git-annex' for git-annex-8.20210803..
Building executable 'git-annex' for git-annex-8.20210803..
[ 6 of 671] Compiling BuildInfo ( BuildInfo.hs, /home/builder/gitbuilder/build/dist-newstyle/build/aarch64-linux/ghc-8.8.4/git-annex-8.20210803/build/git-annex/git-annex-tmp/BuildInfo.o ) [Build/Version changed]
[176 of 671] Compiling Database.Keys.SQL ( Database/Keys/SQL.hs, /home/builder/gitbuilder/build/dist-newstyle/build/aarch64-linux/ghc-8.8.4/git-annex-8.20210803/build/git-annex/git-annex-tmp/Database/Keys/SQL.o )
qemu: Unsupported syscall: 241
cannot find object file `/home/builder/gitbuilder/build/dist-newstyle/build/aarch64-linux/ghc-8.8.4/git-annex-8.20210803/build/git-annex/git-annex-tmp/Types/Key.dyn_o'
while linking an interpreted expression
make[1]: *** [Makefile:58: git-annex] Error 1
make[1]: Leaving directory '/home/builder/gitbuilder/build'
+ timeout 360m make linuxstandalone
/bin/make git-annex Build/Standalone
make[1]: Entering directory '/home/builder/gitbuilder/build'
cabal build
Build profile: -w ghc-8.8.4 -O1
In order, the following will be built (use -v for more details):
- git-annex-8.20210803 (exe:git-annex) (first run)
Linking /home/builder/gitbuilder/build/dist-newstyle/build/aarch64-linux/ghc-8.8.4/git-annex-8.20210803/setup/setup ...
Preprocessing executable 'git-annex' for git-annex-8.20210803..
Building executable 'git-annex' for git-annex-8.20210803..
[176 of 671] Compiling Database.Keys.SQL ( Database/Keys/SQL.hs, /home/builder/gitbuilder/build/dist-newstyle/build/aarch64-linux/ghc-8.8.4/git-annex-8.20210803/build/git-annex/git-annex-tmp/Database/Keys/SQL.o )
qemu: Unsupported syscall: 241
cannot find object file `/home/builder/gitbuilder/build/dist-newstyle/build/aarch64-linux/ghc-8.8.4/git-annex-8.20210803/build/git-annex/git-annex-tmp/Types/Key.dyn_o'
while linking an interpreted expression
make[1]: *** [Makefile:58: git-annex] Error 1
make[1]: Leaving directory '/home/builder/gitbuilder/build'
+ timeout 360m make linuxstandalone
/bin/make git-annex Build/Standalone
make[1]: Entering directory '/home/builder/gitbuilder/build'
cabal build
Build profile: -w ghc-8.8.4 -O1
In order, the following will be built (use -v for more details):
- git-annex-8.20210803 (exe:git-annex) (first run)
Linking /home/builder/gitbuilder/build/dist-newstyle/build/aarch64-linux/ghc-8.8.4/git-annex-8.20210803/setup/setup ...
Preprocessing executable 'git-annex' for git-annex-8.20210803..
Building executable 'git-annex' for git-annex-8.20210803..
[176 of 671] Compiling Database.Keys.SQL ( Database/Keys/SQL.hs, /home/builder/gitbuilder/build/dist-newstyle/build/aarch64-linux/ghc-8.8.4/git-annex-8.20210803/build/git-annex/git-annex-tmp/Database/Keys/SQL.o )
qemu: Unsupported syscall: 241
cannot find object file `/home/builder/gitbuilder/build/dist-newstyle/build/aarch64-linux/ghc-8.8.4/git-annex-8.20210803/build/git-annex/git-annex-tmp/Types/Key.dyn_o'
while linking an interpreted expression
make[1]: *** [Makefile:58: git-annex] Error 1
make[1]: Leaving directory '/home/builder/gitbuilder/build'
+ timeout 360m make linuxstandalone
/bin/make git-annex Build/Standalone
make[1]: Entering directory '/home/builder/gitbuilder/build'
cabal build
Build profile: -w ghc-8.8.4 -O1
In order, the following will be built (use -v for more details):
- git-annex-8.20210803 (exe:git-annex) (first run)
Linking /home/builder/gitbuilder/build/dist-newstyle/build/aarch64-linux/ghc-8.8.4/git-annex-8.20210803/setup/setup ...
Preprocessing executable 'git-annex' for git-annex-8.20210803..
Building executable 'git-annex' for git-annex-8.20210803..

: error:
Make sure you have installed LLVM 9

: error:
Make sure you have installed LLVM 9

: error:
Make sure you have installed LLVM 9

: error:
Make sure you have installed LLVM 9

: error:
Make sure you have installed LLVM 9

: error:
Make sure you have installed LLVM 9

: error:
Make sure you have installed LLVM 9

: error:
Make sure you have installed LLVM 9

: error:
Make sure you have installed LLVM 9

: error:
Make sure you have installed LLVM 9

: error:
Make sure you have installed LLVM 9

: error:
Make sure you have installed LLVM 9

: error:
Make sure you have installed LLVM 9

: error:
Make sure you have installed LLVM 9

: error:
Make sure you have installed LLVM 9

: error:
Make sure you have installed LLVM 9

: error:
Make sure you have installed LLVM 9

: error:
Make sure you have installed LLVM 9

: error:
Make sure you have installed LLVM 9

: error:
Make sure you have installed LLVM 9

: error:
Make sure you have installed LLVM 9

: error:
Make sure you have installed LLVM 9

: error:
Make sure you have installed LLVM 9

aarch64-linux-gnu-gcc: builderMainLoop: fork: resource exhausted (Cannot allocate memory)
|
1 | {- Assistant autostart file installation
| ^

aarch64-linux-gnu-gcc: builderMainLoop: fork: resource exhausted (Cannot allocate memory)
|
1 | {- Assistant menu installation.
| ^

aarch64-linux-gnu-gcc: builderMainLoop: fork: resource exhausted (Cannot allocate memory)
|
1 | {- git-annex assistant named threads.
| ^

aarch64-linux-gnu-gcc: builderMainLoop: fork: resource exhausted (Cannot allocate memory)
|
1 | {- git-annex assistant repository repair
| ^

aarch64-linux-gnu-gcc: builderMainLoop: fork: resource exhausted (Cannot allocate memory)
|
1 | {- git-annex assistant restarting
| ^

aarch64-linux-gnu-gcc: builderMainLoop: fork: resource exhausted (Cannot allocate memory)
|
1 | {- git-annex assistant commit thread
| ^

aarch64-linux-gnu-gcc: builderMainLoop: fork: resource exhausted (Cannot allocate memory)
|
1 | {- git-annex assistant Amazon Glacier retrieval
| ^

aarch64-linux-gnu-gcc: builderMainLoop: fork: resource exhausted (Cannot allocate memory)
|
1 | {- git-annex assistant mount watcher, using either dbus or mtab polling
| ^

aarch64-linux-gnu-gcc: builderMainLoop: fork: resource exhausted (Cannot allocate memory)
|
1 | {- git-annex assistant network connection watcher, using dbus
| ^

aarch64-linux-gnu-gcc: builderMainLoop: fork: resource exhausted (Cannot allocate memory)
|
1 | {- git-annex assistant sanity checker
| ^

aarch64-linux-gnu-gcc: builderMainLoop: fork: resource exhausted (Cannot allocate memory)
|
1 | {- git-annex assistant thread to detect when git-annex is upgraded
| ^

aarch64-linux-gnu-gcc: builderMainLoop: fork: resource exhausted (Cannot allocate memory)
|
1 | {- git-annex assistant thread to detect when upgrade is available
| ^

aarch64-linux-gnu-gcc: builderMainLoop: fork: resource exhausted (Cannot allocate memory)
|
1 | {- git-annex assistant tree watcher
| ^

aarch64-linux-gnu-gcc: builderMainLoop: fork: resource exhausted (Cannot allocate memory)
|
1 | {- git-annex assistant transfer slots
| ^

aarch64-linux-gnu-gcc: builderMainLoop: fork: resource exhausted (Cannot allocate memory)
|
1 | {- webapp url renderer access from the assistant
| ^

aarch64-linux-gnu-gcc: builderMainLoop: fork: resource exhausted (Cannot allocate memory)
|
1 | {- git-annex assistant upgrading
| ^

aarch64-linux-gnu-gcc: builderMainLoop: fork: resource exhausted (Cannot allocate memory)
|
1 | {- git-annex assistant webapp configurators for making local repositories
| ^

aarch64-linux-gnu-gcc: builderMainLoop: fork: resource exhausted (Cannot allocate memory)
|
1 | {- git-annex assistant webapp configurator for pairing
| ^

aarch64-linux-gnu-gcc: builderMainLoop: fork: resource exhausted (Cannot allocate memory)
|
1 | {- git-annex assistant webapp dashboard
| ^

aarch64-linux-gnu-gcc: builderMainLoop: fork: resource exhausted (Cannot allocate memory)
|
1 | {- git-annex assistant webapp types
| ^

aarch64-linux-gnu-gcc: builderMainLoop: fork: resource exhausted (Cannot allocate memory)
|
1 | {- git-annex webapp launcher
| ^

aarch64-linux-gnu-gcc: builderMainLoop: fork: resource exhausted (Cannot allocate memory)
|
1 | {- Yesod webapp
| ^

aarch64-linux-gnu-gcc: builderMainLoop: fork: resource exhausted (Cannot allocate memory)
|
1 | {- git-annex main program dispatch
| ^
make[1]: *** [Makefile:58: git-annex] Error 1
make[1]: Leaving directory '/home/builder/gitbuilder/build'
+ exit 3

>>> Result code: 40
FAIL
renamed 'out/log' -> 'out/fail/5a2818f9cf9dbb83fcb287e984e36b2807062f14'
Done: 5a2818f9cf9dbb83fcb287e984e36b2807062f14