<< index

Autobuilder log for tags/8.20210621~3 (694fe3702c7cd7e4a8343423aaa3eda76c2778cd):

>>> Starting at: Mon Jun 21 23:03:33 BST 2021

>>> Commit: 694fe3702c7cd7e4a8343423aaa3eda76c2778cd

>>> Switching git branch...
--START-IGNORE-WARNINGS
HEAD is now at 17170cddc Merge branch 'master' of ssh://git-annex.branchable.com
Previous HEAD position was 17170cddc Merge branch 'master' of ssh://git-annex.branchable.com
HEAD is now at 694fe3702 fix 2 build warnings
HEAD is now at 694fe3702 fix 2 build warnings
--STOP-IGNORE-WARNINGS

>>> Cleaning...

>>> Building...
+ unset GIT_ANNEX_TMP_BUILD_DIR
+ unset GIT_ANNEX_LOCAL_FEATURES
++ git rev-parse HEAD
+ REV=694fe3702c7cd7e4a8343423aaa3eda76c2778cd
+ OUTDIR=../out/output/sha1/694fe3702c7cd7e4a8343423aaa3eda76c2778cd
+ OUTDIR_TMP=../out/output/sha1/694fe3702c7cd7e4a8343423aaa3eda76c2778cd.tmp
+ install -d -m0755 -- ../out/output/sha1/694fe3702c7cd7e4a8343423aaa3eda76c2778cd.tmp
+ printf '%s\n' 694fe3702c7cd7e4a8343423aaa3eda76c2778cd
+ ghc --make Build/BuildVersion
Linking Build/BuildVersion ...
+ Build/BuildVersion
+ timeout 60m make linuxstandalone
/bin/make git-annex Build/Standalone
make[1]: Entering directory '/home/builder/gitbuilder/build'
cabal build
Resolving dependencies...
Build profile: -w ghc-8.8.4 -O1
In order, the following will be built (use -v for more details):
- git-annex-8.20210428 (exe:git-annex) (file Annex/Drop.hs changed)
Linking /home/builder/gitbuilder/build/dist-newstyle/build/aarch64-linux/ghc-8.8.4/git-annex-8.20210428/setup/setup ...
Preprocessing executable 'git-annex' for git-annex-8.20210428..
Building executable 'git-annex' for git-annex-8.20210428..
[ 6 of 669] Compiling BuildInfo ( BuildInfo.hs, /home/builder/gitbuilder/build/dist-newstyle/build/aarch64-linux/ghc-8.8.4/git-annex-8.20210428/build/git-annex/git-annex-tmp/BuildInfo.o ) [Build/Version changed]
[301 of 669] Compiling Annex.Url ( Annex/Url.hs, /home/builder/gitbuilder/build/dist-newstyle/build/aarch64-linux/ghc-8.8.4/git-annex-8.20210428/build/git-annex/git-annex-tmp/Annex/Url.o ) [BuildInfo changed]
[462 of 669] Compiling Command.Version ( Command/Version.hs, /home/builder/gitbuilder/build/dist-newstyle/build/aarch64-linux/ghc-8.8.4/git-annex-8.20210428/build/git-annex/git-annex-tmp/Command/Version.o ) [BuildInfo changed]
[605 of 669] Compiling Assistant.WebApp.Types ( Assistant/WebApp/Types.hs, /home/builder/gitbuilder/build/dist-newstyle/build/aarch64-linux/ghc-8.8.4/git-annex-8.20210428/build/git-annex/git-annex-tmp/Assistant/WebApp/Types.o ) [BuildInfo changed]
qemu: Unsupported syscall: 241
opt-9: builderMainLoop: fork: resource exhausted (Cannot allocate memory)
make[1]: *** [Makefile:58: git-annex] Error 1
make[1]: Leaving directory '/home/builder/gitbuilder/build'
+ timeout 360m make linuxstandalone
/bin/make git-annex Build/Standalone
make[1]: Entering directory '/home/builder/gitbuilder/build'
cabal build
Build profile: -w ghc-8.8.4 -O1
In order, the following will be built (use -v for more details):
- git-annex-8.20210428 (exe:git-annex) (file Annex/Drop.hs changed)
Linking /home/builder/gitbuilder/build/dist-newstyle/build/aarch64-linux/ghc-8.8.4/git-annex-8.20210428/setup/setup ...
Preprocessing executable 'git-annex' for git-annex-8.20210428..
Building executable 'git-annex' for git-annex-8.20210428..
[612 of 669] Compiling Assistant.WebApp.Documentation ( Assistant/WebApp/Documentation.hs, /home/builder/gitbuilder/build/dist-newstyle/build/aarch64-linux/ghc-8.8.4/git-annex-8.20210428/build/git-annex/git-annex-tmp/Assistant/WebApp/Documentation.o ) [BuildInfo changed]
qemu: Unsupported syscall: 241
[652 of 669] Compiling Assistant.Threads.Upgrader ( Assistant/Threads/Upgrader.hs, /home/builder/gitbuilder/build/dist-newstyle/build/aarch64-linux/ghc-8.8.4/git-annex-8.20210428/build/git-annex/git-annex-tmp/Assistant/Threads/Upgrader.o ) [BuildInfo changed]
[653 of 669] Compiling Assistant.Threads.UpgradeWatcher ( Assistant/Threads/UpgradeWatcher.hs, /home/builder/gitbuilder/build/dist-newstyle/build/aarch64-linux/ghc-8.8.4/git-annex-8.20210428/build/git-annex/git-annex-tmp/Assistant/Threads/UpgradeWatcher.o ) [BuildInfo changed]
[661 of 669] Compiling Assistant.Threads.WebApp ( Assistant/Threads/WebApp.hs, /home/builder/gitbuilder/build/dist-newstyle/build/aarch64-linux/ghc-8.8.4/git-annex-8.20210428/build/git-annex/git-annex-tmp/Assistant/Threads/WebApp.o ) [Assistant.WebApp.Documentation changed]
[667 of 669] Compiling CmdLine.GitAnnex ( CmdLine/GitAnnex.hs, /home/builder/gitbuilder/build/dist-newstyle/build/aarch64-linux/ghc-8.8.4/git-annex-8.20210428/build/git-annex/git-annex-tmp/CmdLine/GitAnnex.o ) [Command.Version changed]
[668 of 669] Compiling Test ( Test.hs, /home/builder/gitbuilder/build/dist-newstyle/build/aarch64-linux/ghc-8.8.4/git-annex-8.20210428/build/git-annex/git-annex-tmp/Test.o )
llc-9: builderMainLoop: fork: resource exhausted (Cannot allocate memory)
make[1]: *** [Makefile:58: git-annex] Error 1
make[1]: Leaving directory '/home/builder/gitbuilder/build'
+ timeout 360m make linuxstandalone
/bin/make git-annex Build/Standalone
make[1]: Entering directory '/home/builder/gitbuilder/build'
cabal build
Build profile: -w ghc-8.8.4 -O1
In order, the following will be built (use -v for more details):
- git-annex-8.20210428 (exe:git-annex) (file Annex/Drop.hs changed)
Linking /home/builder/gitbuilder/build/dist-newstyle/build/aarch64-linux/ghc-8.8.4/git-annex-8.20210428/setup/setup ...
Preprocessing executable 'git-annex' for git-annex-8.20210428..
Building executable 'git-annex' for git-annex-8.20210428..
[668 of 669] Compiling Test ( Test.hs, /home/builder/gitbuilder/build/dist-newstyle/build/aarch64-linux/ghc-8.8.4/git-annex-8.20210428/build/git-annex/git-annex-tmp/Test.o )
llc-9: builderMainLoop: fork: resource exhausted (Cannot allocate memory)
make[1]: *** [Makefile:58: git-annex] Error 1
make[1]: Leaving directory '/home/builder/gitbuilder/build'
+ timeout 360m make linuxstandalone
/bin/make git-annex Build/Standalone
make[1]: Entering directory '/home/builder/gitbuilder/build'
cabal build
Build profile: -w ghc-8.8.4 -O1
In order, the following will be built (use -v for more details):
- git-annex-8.20210428 (exe:git-annex) (file Annex/Drop.hs changed)
cabal: Failed to build git-annex-8.20210428. The exception was:
dieVerbatim: user error (cabal: '/bin/ghc' exited with an error:
)

make[1]: *** [Makefile:58: git-annex] Error 1
make[1]: Leaving directory '/home/builder/gitbuilder/build'
+ exit 3

>>> Result code: 40
FAIL
renamed 'out/log' -> 'out/fail/694fe3702c7cd7e4a8343423aaa3eda76c2778cd'
Done: 694fe3702c7cd7e4a8343423aaa3eda76c2778cd