<< index

Autobuilder log for tags/8.20210903~53 (a7cf5abf3b04f3b7339435419617960703f7402f):

>>> Starting at: Thu Aug 26 00:05:42 BST 2021

>>> Commit: a7cf5abf3b04f3b7339435419617960703f7402f

>>> Switching git branch...
--START-IGNORE-WARNINGS
HEAD is now at d54a25ed9 initial report on inability to get data of others via ssh
Previous HEAD position was d54a25ed9 initial report on inability to get data of others via ssh
HEAD is now at a7cf5abf3 Added a comment
HEAD is now at a7cf5abf3 Added a comment
--STOP-IGNORE-WARNINGS

>>> Cleaning...

>>> Building...
+ unset GIT_ANNEX_TMP_BUILD_DIR
+ unset GIT_ANNEX_LOCAL_FEATURES
++ git rev-parse HEAD
+ REV=a7cf5abf3b04f3b7339435419617960703f7402f
+ OUTDIR=../out/output/sha1/a7cf5abf3b04f3b7339435419617960703f7402f
+ OUTDIR_TMP=../out/output/sha1/a7cf5abf3b04f3b7339435419617960703f7402f.tmp
+ install -d -m0755 -- ../out/output/sha1/a7cf5abf3b04f3b7339435419617960703f7402f.tmp
+ printf '%s\n' a7cf5abf3b04f3b7339435419617960703f7402f
+ ghc --make Build/BuildVersion
Linking Build/BuildVersion ...
+ Build/BuildVersion
+ timeout 60m make linuxstandalone
/bin/make git-annex Build/Standalone
make[1]: Entering directory '/home/builder/gitbuilder/build'
cabal build
Resolving dependencies...
Build profile: -w ghc-8.8.4 -O1
In order, the following will be built (use -v for more details):
- git-annex-8.20210803 (exe:git-annex) (first run)
Linking /home/builder/gitbuilder/build/dist-newstyle/build/aarch64-linux/ghc-8.8.4/git-annex-8.20210803/setup/setup ...
Preprocessing executable 'git-annex' for git-annex-8.20210803..
Building executable 'git-annex' for git-annex-8.20210803..
[ 6 of 671] Compiling BuildInfo ( BuildInfo.hs, /home/builder/gitbuilder/build/dist-newstyle/build/aarch64-linux/ghc-8.8.4/git-annex-8.20210803/build/git-annex/git-annex-tmp/BuildInfo.o ) [Build/Version changed]
[176 of 671] Compiling Database.Keys.SQL ( Database/Keys/SQL.hs, /home/builder/gitbuilder/build/dist-newstyle/build/aarch64-linux/ghc-8.8.4/git-annex-8.20210803/build/git-annex/git-annex-tmp/Database/Keys/SQL.o )
qemu: Unsupported syscall: 241
cannot find object file `/home/builder/gitbuilder/build/dist-newstyle/build/aarch64-linux/ghc-8.8.4/git-annex-8.20210803/build/git-annex/git-annex-tmp/Types/Key.dyn_o'
while linking an interpreted expression
make[1]: *** [Makefile:58: git-annex] Error 1
make[1]: Leaving directory '/home/builder/gitbuilder/build'
+ timeout 360m make linuxstandalone
/bin/make git-annex Build/Standalone
make[1]: Entering directory '/home/builder/gitbuilder/build'
cabal build
Build profile: -w ghc-8.8.4 -O1
In order, the following will be built (use -v for more details):
- git-annex-8.20210803 (exe:git-annex) (first run)
Linking /home/builder/gitbuilder/build/dist-newstyle/build/aarch64-linux/ghc-8.8.4/git-annex-8.20210803/setup/setup ...
Preprocessing executable 'git-annex' for git-annex-8.20210803..
Building executable 'git-annex' for git-annex-8.20210803..
[176 of 671] Compiling Database.Keys.SQL ( Database/Keys/SQL.hs, /home/builder/gitbuilder/build/dist-newstyle/build/aarch64-linux/ghc-8.8.4/git-annex-8.20210803/build/git-annex/git-annex-tmp/Database/Keys/SQL.o )
qemu: Unsupported syscall: 241
cannot find object file `/home/builder/gitbuilder/build/dist-newstyle/build/aarch64-linux/ghc-8.8.4/git-annex-8.20210803/build/git-annex/git-annex-tmp/Types/Key.dyn_o'
while linking an interpreted expression
make[1]: *** [Makefile:58: git-annex] Error 1
make[1]: Leaving directory '/home/builder/gitbuilder/build'
+ timeout 360m make linuxstandalone
/bin/make git-annex Build/Standalone
make[1]: Entering directory '/home/builder/gitbuilder/build'
cabal build
Build profile: -w ghc-8.8.4 -O1
In order, the following will be built (use -v for more details):
- git-annex-8.20210803 (exe:git-annex) (first run)
Linking /home/builder/gitbuilder/build/dist-newstyle/build/aarch64-linux/ghc-8.8.4/git-annex-8.20210803/setup/setup ...
Preprocessing executable 'git-annex' for git-annex-8.20210803..
Building executable 'git-annex' for git-annex-8.20210803..
[176 of 671] Compiling Database.Keys.SQL ( Database/Keys/SQL.hs, /home/builder/gitbuilder/build/dist-newstyle/build/aarch64-linux/ghc-8.8.4/git-annex-8.20210803/build/git-annex/git-annex-tmp/Database/Keys/SQL.o )
qemu: Unsupported syscall: 241
cannot find object file `/home/builder/gitbuilder/build/dist-newstyle/build/aarch64-linux/ghc-8.8.4/git-annex-8.20210803/build/git-annex/git-annex-tmp/Types/Key.dyn_o'
while linking an interpreted expression
make[1]: *** [Makefile:58: git-annex] Error 1
make[1]: Leaving directory '/home/builder/gitbuilder/build'
+ timeout 360m make linuxstandalone
/bin/make git-annex Build/Standalone
make[1]: Entering directory '/home/builder/gitbuilder/build'
cabal build
Build profile: -w ghc-8.8.4 -O1
In order, the following will be built (use -v for more details):
- git-annex-8.20210803 (exe:git-annex) (first run)
Linking /home/builder/gitbuilder/build/dist-newstyle/build/aarch64-linux/ghc-8.8.4/git-annex-8.20210803/setup/setup ...
Preprocessing executable 'git-annex' for git-annex-8.20210803..
Building executable 'git-annex' for git-annex-8.20210803..
[176 of 671] Compiling Database.Keys.SQL ( Database/Keys/SQL.hs, /home/builder/gitbuilder/build/dist-newstyle/build/aarch64-linux/ghc-8.8.4/git-annex-8.20210803/build/git-annex/git-annex-tmp/Database/Keys/SQL.o )
qemu: Unsupported syscall: 241
cannot find object file `/home/builder/gitbuilder/build/dist-newstyle/build/aarch64-linux/ghc-8.8.4/git-annex-8.20210803/build/git-annex/git-annex-tmp/Types/Key.dyn_o'
while linking an interpreted expression
make[1]: *** [Makefile:58: git-annex] Error 1
make[1]: Leaving directory '/home/builder/gitbuilder/build'
+ exit 3

>>> Result code: 40
FAIL
renamed 'out/log' -> 'out/fail/a7cf5abf3b04f3b7339435419617960703f7402f'
Done: a7cf5abf3b04f3b7339435419617960703f7402f