<< index

Autobuilder log for tags/8.20210714~17 (bb87ee337533697c3c297c0cb31a0dfd39831ef1):

>>> Starting at: Mon Jul 12 16:04:01 BST 2021

>>> Commit: bb87ee337533697c3c297c0cb31a0dfd39831ef1

>>> Switching git branch...
--START-IGNORE-WARNINGS
HEAD is now at 215aee105 commet
Previous HEAD position was 215aee105 commet
HEAD is now at bb87ee337 comment
HEAD is now at bb87ee337 comment
--STOP-IGNORE-WARNINGS

>>> Cleaning...

>>> Building...
+ unset GIT_ANNEX_TMP_BUILD_DIR
+ unset GIT_ANNEX_LOCAL_FEATURES
++ git rev-parse HEAD
+ REV=bb87ee337533697c3c297c0cb31a0dfd39831ef1
+ OUTDIR=../out/output/sha1/bb87ee337533697c3c297c0cb31a0dfd39831ef1
+ OUTDIR_TMP=../out/output/sha1/bb87ee337533697c3c297c0cb31a0dfd39831ef1.tmp
+ install -d -m0755 -- ../out/output/sha1/bb87ee337533697c3c297c0cb31a0dfd39831ef1.tmp
+ printf '%s\n' bb87ee337533697c3c297c0cb31a0dfd39831ef1
+ ghc --make Build/BuildVersion
Linking Build/BuildVersion ...
+ Build/BuildVersion
+ timeout 60m make linuxstandalone
/bin/make git-annex Build/Standalone
make[1]: Entering directory '/home/builder/gitbuilder/build'
cabal build
Resolving dependencies...
Build profile: -w ghc-8.8.4 -O1
In order, the following will be built (use -v for more details):
- git-annex-8.20210630 (exe:git-annex) (first run)
Linking /home/builder/gitbuilder/build/dist-newstyle/build/aarch64-linux/ghc-8.8.4/git-annex-8.20210630/setup/setup ...
Preprocessing executable 'git-annex' for git-annex-8.20210630..
Building executable 'git-annex' for git-annex-8.20210630..
[ 6 of 669] Compiling BuildInfo ( BuildInfo.hs, /home/builder/gitbuilder/build/dist-newstyle/build/aarch64-linux/ghc-8.8.4/git-annex-8.20210630/build/git-annex/git-annex-tmp/BuildInfo.o ) [Build/Version changed]
[176 of 669] Compiling Database.Keys.SQL ( Database/Keys/SQL.hs, /home/builder/gitbuilder/build/dist-newstyle/build/aarch64-linux/ghc-8.8.4/git-annex-8.20210630/build/git-annex/git-annex-tmp/Database/Keys/SQL.o )
qemu: Unsupported syscall: 241
cannot find object file `/home/builder/gitbuilder/build/dist-newstyle/build/aarch64-linux/ghc-8.8.4/git-annex-8.20210630/build/git-annex/git-annex-tmp/Utility/Path.dyn_o'
while linking an interpreted expression
make[1]: *** [Makefile:58: git-annex] Error 1
make[1]: Leaving directory '/home/builder/gitbuilder/build'
+ timeout 360m make linuxstandalone
/bin/make git-annex Build/Standalone
make[1]: Entering directory '/home/builder/gitbuilder/build'
cabal build
Build profile: -w ghc-8.8.4 -O1
In order, the following will be built (use -v for more details):
- git-annex-8.20210630 (exe:git-annex) (first run)
Linking /home/builder/gitbuilder/build/dist-newstyle/build/aarch64-linux/ghc-8.8.4/git-annex-8.20210630/setup/setup ...
Preprocessing executable 'git-annex' for git-annex-8.20210630..
Building executable 'git-annex' for git-annex-8.20210630..
[176 of 669] Compiling Database.Keys.SQL ( Database/Keys/SQL.hs, /home/builder/gitbuilder/build/dist-newstyle/build/aarch64-linux/ghc-8.8.4/git-annex-8.20210630/build/git-annex/git-annex-tmp/Database/Keys/SQL.o )
qemu: Unsupported syscall: 241
cannot find object file `/home/builder/gitbuilder/build/dist-newstyle/build/aarch64-linux/ghc-8.8.4/git-annex-8.20210630/build/git-annex/git-annex-tmp/Utility/Path.dyn_o'
while linking an interpreted expression
make[1]: *** [Makefile:58: git-annex] Error 1
make[1]: Leaving directory '/home/builder/gitbuilder/build'
+ timeout 360m make linuxstandalone
/bin/make git-annex Build/Standalone
make[1]: Entering directory '/home/builder/gitbuilder/build'
cabal build
Build profile: -w ghc-8.8.4 -O1
In order, the following will be built (use -v for more details):
- git-annex-8.20210630 (exe:git-annex) (first run)
Linking /home/builder/gitbuilder/build/dist-newstyle/build/aarch64-linux/ghc-8.8.4/git-annex-8.20210630/setup/setup ...
Preprocessing executable 'git-annex' for git-annex-8.20210630..
Building executable 'git-annex' for git-annex-8.20210630..
[176 of 669] Compiling Database.Keys.SQL ( Database/Keys/SQL.hs, /home/builder/gitbuilder/build/dist-newstyle/build/aarch64-linux/ghc-8.8.4/git-annex-8.20210630/build/git-annex/git-annex-tmp/Database/Keys/SQL.o )
qemu: Unsupported syscall: 241
cannot find object file `/home/builder/gitbuilder/build/dist-newstyle/build/aarch64-linux/ghc-8.8.4/git-annex-8.20210630/build/git-annex/git-annex-tmp/Utility/Path.dyn_o'
while linking an interpreted expression
make[1]: *** [Makefile:58: git-annex] Error 1
make[1]: Leaving directory '/home/builder/gitbuilder/build'
+ timeout 360m make linuxstandalone
/bin/make git-annex Build/Standalone
make[1]: Entering directory '/home/builder/gitbuilder/build'
cabal build
Build profile: -w ghc-8.8.4 -O1
In order, the following will be built (use -v for more details):
- git-annex-8.20210630 (exe:git-annex) (first run)
Linking /home/builder/gitbuilder/build/dist-newstyle/build/aarch64-linux/ghc-8.8.4/git-annex-8.20210630/setup/setup ...
Preprocessing executable 'git-annex' for git-annex-8.20210630..
Building executable 'git-annex' for git-annex-8.20210630..

: error:
Make sure you have installed LLVM 9

: error:
Make sure you have installed LLVM 9

: error:
Make sure you have installed LLVM 9

: error:
Make sure you have installed LLVM 9

: error:
Make sure you have installed LLVM 9

: error:
Make sure you have installed LLVM 9

aarch64-linux-gnu-gcc: builderMainLoop: fork: resource exhausted (Cannot allocate memory)
|
1 | {- git-annex assistant webapp configurators for making local repositories
| ^

aarch64-linux-gnu-gcc: builderMainLoop: fork: resource exhausted (Cannot allocate memory)
|
1 | {- git-annex assistant webapp configurator for pairing
| ^

aarch64-linux-gnu-gcc: builderMainLoop: fork: resource exhausted (Cannot allocate memory)
|
1 | {- git-annex assistant webapp dashboard
| ^

aarch64-linux-gnu-gcc: builderMainLoop: fork: resource exhausted (Cannot allocate memory)
|
1 | {- git-annex assistant webapp types
| ^

aarch64-linux-gnu-gcc: builderMainLoop: fork: resource exhausted (Cannot allocate memory)
|
1 | {- Yesod webapp
| ^

aarch64-linux-gnu-gcc: builderMainLoop: fork: resource exhausted (Cannot allocate memory)
|
1 | {- git-annex main program dispatch
| ^
make[1]: *** [Makefile:58: git-annex] Error 1
make[1]: Leaving directory '/home/builder/gitbuilder/build'
+ exit 3

>>> Result code: 40
FAIL
renamed 'out/log' -> 'out/fail/bb87ee337533697c3c297c0cb31a0dfd39831ef1'
Done: bb87ee337533697c3c297c0cb31a0dfd39831ef1