<< index

Autobuilder log for tags/8.20210903~119 (d424f431169f797d9e9b9e1439fe77865bde1e7c):

>>> Starting at: Mon Aug 9 21:03:33 BST 2021

>>> Commit: d424f431169f797d9e9b9e1439fe77865bde1e7c

>>> Switching git branch...
--START-IGNORE-WARNINGS
HEAD is now at 8ede4b606 Added a comment
Previous HEAD position was 8ede4b606 Added a comment
HEAD is now at d424f4311 comment
HEAD is now at d424f4311 comment
--STOP-IGNORE-WARNINGS

>>> Cleaning...

>>> Building...
+ unset GIT_ANNEX_TMP_BUILD_DIR
+ unset GIT_ANNEX_LOCAL_FEATURES
++ git rev-parse HEAD
+ REV=d424f431169f797d9e9b9e1439fe77865bde1e7c
+ OUTDIR=../out/output/sha1/d424f431169f797d9e9b9e1439fe77865bde1e7c
+ OUTDIR_TMP=../out/output/sha1/d424f431169f797d9e9b9e1439fe77865bde1e7c.tmp
+ install -d -m0755 -- ../out/output/sha1/d424f431169f797d9e9b9e1439fe77865bde1e7c.tmp
+ printf '%s\n' d424f431169f797d9e9b9e1439fe77865bde1e7c
+ ghc --make Build/BuildVersion
Linking Build/BuildVersion ...
+ Build/BuildVersion
+ timeout 60m make linuxstandalone
/bin/make git-annex Build/Standalone
make[1]: Entering directory '/home/builder/gitbuilder/build'
cabal build
Resolving dependencies...
Build profile: -w ghc-8.8.4 -O1
In order, the following will be built (use -v for more details):
- git-annex-8.20210803 (exe:git-annex) (first run)
Linking /home/builder/gitbuilder/build/dist-newstyle/build/aarch64-linux/ghc-8.8.4/git-annex-8.20210803/setup/setup ...
Preprocessing executable 'git-annex' for git-annex-8.20210803..
Building executable 'git-annex' for git-annex-8.20210803..
[ 6 of 671] Compiling BuildInfo ( BuildInfo.hs, /home/builder/gitbuilder/build/dist-newstyle/build/aarch64-linux/ghc-8.8.4/git-annex-8.20210803/build/git-annex/git-annex-tmp/BuildInfo.o ) [Build/Version changed]
[176 of 671] Compiling Database.Keys.SQL ( Database/Keys/SQL.hs, /home/builder/gitbuilder/build/dist-newstyle/build/aarch64-linux/ghc-8.8.4/git-annex-8.20210803/build/git-annex/git-annex-tmp/Database/Keys/SQL.o )
qemu: Unsupported syscall: 241
cannot find object file `/home/builder/gitbuilder/build/dist-newstyle/build/aarch64-linux/ghc-8.8.4/git-annex-8.20210803/build/git-annex/git-annex-tmp/Types/Key.dyn_o'
while linking an interpreted expression
make[1]: *** [Makefile:58: git-annex] Error 1
make[1]: Leaving directory '/home/builder/gitbuilder/build'
+ timeout 360m make linuxstandalone
/bin/make git-annex Build/Standalone
make[1]: Entering directory '/home/builder/gitbuilder/build'
cabal build
Build profile: -w ghc-8.8.4 -O1
In order, the following will be built (use -v for more details):
- git-annex-8.20210803 (exe:git-annex) (first run)
Linking /home/builder/gitbuilder/build/dist-newstyle/build/aarch64-linux/ghc-8.8.4/git-annex-8.20210803/setup/setup ...
Preprocessing executable 'git-annex' for git-annex-8.20210803..
Building executable 'git-annex' for git-annex-8.20210803..
[176 of 671] Compiling Database.Keys.SQL ( Database/Keys/SQL.hs, /home/builder/gitbuilder/build/dist-newstyle/build/aarch64-linux/ghc-8.8.4/git-annex-8.20210803/build/git-annex/git-annex-tmp/Database/Keys/SQL.o )
qemu: Unsupported syscall: 241
cannot find object file `/home/builder/gitbuilder/build/dist-newstyle/build/aarch64-linux/ghc-8.8.4/git-annex-8.20210803/build/git-annex/git-annex-tmp/Types/Key.dyn_o'
while linking an interpreted expression
make[1]: *** [Makefile:58: git-annex] Error 1
make[1]: Leaving directory '/home/builder/gitbuilder/build'
+ timeout 360m make linuxstandalone
/bin/make git-annex Build/Standalone
make[1]: Entering directory '/home/builder/gitbuilder/build'
cabal build
Build profile: -w ghc-8.8.4 -O1
In order, the following will be built (use -v for more details):
- git-annex-8.20210803 (exe:git-annex) (first run)
Linking /home/builder/gitbuilder/build/dist-newstyle/build/aarch64-linux/ghc-8.8.4/git-annex-8.20210803/setup/setup ...
Preprocessing executable 'git-annex' for git-annex-8.20210803..
Building executable 'git-annex' for git-annex-8.20210803..
[176 of 671] Compiling Database.Keys.SQL ( Database/Keys/SQL.hs, /home/builder/gitbuilder/build/dist-newstyle/build/aarch64-linux/ghc-8.8.4/git-annex-8.20210803/build/git-annex/git-annex-tmp/Database/Keys/SQL.o )
qemu: Unsupported syscall: 241
cannot find object file `/home/builder/gitbuilder/build/dist-newstyle/build/aarch64-linux/ghc-8.8.4/git-annex-8.20210803/build/git-annex/git-annex-tmp/Types/Key.dyn_o'
while linking an interpreted expression
make[1]: *** [Makefile:58: git-annex] Error 1
make[1]: Leaving directory '/home/builder/gitbuilder/build'
+ timeout 360m make linuxstandalone
/bin/make git-annex Build/Standalone
make[1]: Entering directory '/home/builder/gitbuilder/build'
cabal build
Build profile: -w ghc-8.8.4 -O1
In order, the following will be built (use -v for more details):
- git-annex-8.20210803 (exe:git-annex) (first run)
Linking /home/builder/gitbuilder/build/dist-newstyle/build/aarch64-linux/ghc-8.8.4/git-annex-8.20210803/setup/setup ...
Preprocessing executable 'git-annex' for git-annex-8.20210803..
Building executable 'git-annex' for git-annex-8.20210803..

: error:
Make sure you have installed LLVM 9

: error:
Make sure you have installed LLVM 9

: error:
Make sure you have installed LLVM 9

: error:
Make sure you have installed LLVM 9

: error:
Make sure you have installed LLVM 9

: error:
Make sure you have installed LLVM 9

: error:
Make sure you have installed LLVM 9

: error:
Make sure you have installed LLVM 9

: error:
Make sure you have installed LLVM 9

: error:
Make sure you have installed LLVM 9

: error:
Make sure you have installed LLVM 9

: error:
Make sure you have installed LLVM 9

: error:
Make sure you have installed LLVM 9

: error:
Make sure you have installed LLVM 9

: error:
Make sure you have installed LLVM 9

: error:
Make sure you have installed LLVM 9

: error:
Make sure you have installed LLVM 9

: error:
Make sure you have installed LLVM 9

: error:
Make sure you have installed LLVM 9

: error:
Make sure you have installed LLVM 9

: error:
Make sure you have installed LLVM 9

: error:
Make sure you have installed LLVM 9

: error:
Make sure you have installed LLVM 9

: error:
Make sure you have installed LLVM 9

: error:
Make sure you have installed LLVM 9

: error:
Make sure you have installed LLVM 9

: error:
Make sure you have installed LLVM 9

: error:
Make sure you have installed LLVM 9

: error:
Make sure you have installed LLVM 9

: error:
Make sure you have installed LLVM 9

: error:
Make sure you have installed LLVM 9

: error:
Make sure you have installed LLVM 9

: error:
Make sure you have installed LLVM 9

: error:
Make sure you have installed LLVM 9

: error:
Make sure you have installed LLVM 9

: error:
Make sure you have installed LLVM 9

: error:
Make sure you have installed LLVM 9

: error:
Make sure you have installed LLVM 9

: error:
Make sure you have installed LLVM 9

: error:
Make sure you have installed LLVM 9

: error:
Make sure you have installed LLVM 9

: error:
Make sure you have installed LLVM 9

: error:
Make sure you have installed LLVM 9

: error:
Make sure you have installed LLVM 9

: error:
Make sure you have installed LLVM 9

: error:
Make sure you have installed LLVM 9

: error:
Make sure you have installed LLVM 9

: error:
Make sure you have installed LLVM 9

: error:
Make sure you have installed LLVM 9

: error:
Make sure you have installed LLVM 9

: error:
Make sure you have installed LLVM 9

: error:
Make sure you have installed LLVM 9

: error:
Make sure you have installed LLVM 9

: error:
Make sure you have installed LLVM 9

: error:
Make sure you have installed LLVM 9

: error:
Make sure you have installed LLVM 9

: error:
Make sure you have installed LLVM 9

: error:
Make sure you have installed LLVM 9

: error:
Make sure you have installed LLVM 9

: error:
Make sure you have installed LLVM 9

: error:
Make sure you have installed LLVM 9

: error:
Make sure you have installed LLVM 9

: error:
Make sure you have installed LLVM 9

: error:
Make sure you have installed LLVM 9

: error:
Make sure you have installed LLVM 9

: error:
Make sure you have installed LLVM 9

: error:
Make sure you have installed LLVM 9

: error:
Make sure you have installed LLVM 9

: error:
Make sure you have installed LLVM 9

: error:
Make sure you have installed LLVM 9

: error:
Make sure you have installed LLVM 9

: error:
Make sure you have installed LLVM 9

: error:
Make sure you have installed LLVM 9

: error:
Make sure you have installed LLVM 9

: error:
Make sure you have installed LLVM 9

: error:
Make sure you have installed LLVM 9

: error:
Make sure you have installed LLVM 9

: error:
Make sure you have installed LLVM 9

: error:
Make sure you have installed LLVM 9

: error:
Make sure you have installed LLVM 9

: error:
Make sure you have installed LLVM 9

: error:
Make sure you have installed LLVM 9

: error:
Make sure you have installed LLVM 9

aarch64-linux-gnu-gcc: builderMainLoop: fork: resource exhausted (Cannot allocate memory)
|
1 | {- git-annex repository versioning
| ^

aarch64-linux-gnu-gcc: builderMainLoop: fork: resource exhausted (Cannot allocate memory)
|
1 | {- filenames (not paths) used in views
| ^

aarch64-linux-gnu-gcc: builderMainLoop: fork: resource exhausted (Cannot allocate memory)
|
1 | {- git-annex assistant alerts
| ^

aarch64-linux-gnu-gcc: builderMainLoop: fork: resource exhausted (Cannot allocate memory)
|
1 | {- git-annex assistant remote deletion utilities
| ^

aarch64-linux-gnu-gcc: builderMainLoop: fork: resource exhausted (Cannot allocate memory)
|
1 | {- Assistant installation
| ^

aarch64-linux-gnu-gcc: builderMainLoop: fork: resource exhausted (Cannot allocate memory)
|
1 | {- Assistant autostart file installation
| ^

aarch64-linux-gnu-gcc: builderMainLoop: fork: resource exhausted (Cannot allocate memory)
|
1 | {- Assistant menu installation.
| ^

aarch64-linux-gnu-gcc: builderMainLoop: fork: resource exhausted (Cannot allocate memory)
|
1 | {- git-annex assistant named threads.
| ^

aarch64-linux-gnu-gcc: builderMainLoop: fork: resource exhausted (Cannot allocate memory)
|
1 | {- git-annex assistant repository repair
| ^

aarch64-linux-gnu-gcc: builderMainLoop: fork: resource exhausted (Cannot allocate memory)
|
1 | {- git-annex assistant restarting
| ^

aarch64-linux-gnu-gcc: builderMainLoop: fork: resource exhausted (Cannot allocate memory)
|
1 | {- git-annex assistant commit thread
| ^

aarch64-linux-gnu-gcc: builderMainLoop: fork: resource exhausted (Cannot allocate memory)
|
1 | {- git-annex assistant Amazon Glacier retrieval
| ^

aarch64-linux-gnu-gcc: builderMainLoop: fork: resource exhausted (Cannot allocate memory)
|
1 | {- git-annex assistant mount watcher, using either dbus or mtab polling
| ^

aarch64-linux-gnu-gcc: builderMainLoop: fork: resource exhausted (Cannot allocate memory)
|
1 | {- git-annex assistant network connection watcher, using dbus
| ^

aarch64-linux-gnu-gcc: builderMainLoop: fork: resource exhausted (Cannot allocate memory)
|
1 | {- git-annex assistant sanity checker
| ^

aarch64-linux-gnu-gcc: builderMainLoop: fork: resource exhausted (Cannot allocate memory)
|
1 | {- git-annex assistant thread to detect when git-annex is upgraded
| ^

aarch64-linux-gnu-gcc: builderMainLoop: fork: resource exhausted (Cannot allocate memory)
|
1 | {- git-annex assistant thread to detect when upgrade is available
| ^

aarch64-linux-gnu-gcc: builderMainLoop: fork: resource exhausted (Cannot allocate memory)
|
1 | {- git-annex assistant tree watcher
| ^

aarch64-linux-gnu-gcc: builderMainLoop: fork: resource exhausted (Cannot allocate memory)
|
1 | {- git-annex assistant transfer slots
| ^

aarch64-linux-gnu-gcc: builderMainLoop: fork: resource exhausted (Cannot allocate memory)
|
1 | {- webapp url renderer access from the assistant
| ^

aarch64-linux-gnu-gcc: builderMainLoop: fork: resource exhausted (Cannot allocate memory)
|
1 | {- git-annex assistant upgrading
| ^

aarch64-linux-gnu-gcc: builderMainLoop: fork: resource exhausted (Cannot allocate memory)
|
1 | {- git-annex assistant webapp configurators for making local repositories
| ^

aarch64-linux-gnu-gcc: builderMainLoop: fork: resource exhausted (Cannot allocate memory)
|
1 | {- git-annex assistant webapp configurator for pairing
| ^

aarch64-linux-gnu-gcc: builderMainLoop: fork: resource exhausted (Cannot allocate memory)
|
1 | {- git-annex assistant webapp dashboard
| ^

aarch64-linux-gnu-gcc: builderMainLoop: fork: resource exhausted (Cannot allocate memory)
|
1 | {- git-annex assistant webapp types
| ^

aarch64-linux-gnu-gcc: builderMainLoop: fork: resource exhausted (Cannot allocate memory)
|
1 | {- Bundled programs
| ^

aarch64-linux-gnu-gcc: builderMainLoop: fork: resource exhausted (Cannot allocate memory)
|
1 | {- Checks system configuration and generates Build/SysConfig and Build/Version. -}
| ^

aarch64-linux-gnu-gcc: builderMainLoop: fork: resource exhausted (Cannot allocate memory)
|
1 | {- Generating and installing a desktop menu entry file and icon,
| ^

aarch64-linux-gnu-gcc: builderMainLoop: fork: resource exhausted (Cannot allocate memory)
|
1 | {- git-annex command-line actions and concurrency
| ^

aarch64-linux-gnu-gcc: builderMainLoop: fork: resource exhausted (Cannot allocate memory)
|
1 | {- git-annex webapp launcher
| ^

aarch64-linux-gnu-gcc: builderMainLoop: fork: resource exhausted (Cannot allocate memory)
|
1 | {- git-remote-daemon, tor hidden service server and transport
| ^

aarch64-linux-gnu-gcc: builderMainLoop: fork: resource exhausted (Cannot allocate memory)
|
1 | {- git-annex test suite framework
| ^

aarch64-linux-gnu-gcc: builderMainLoop: fork: resource exhausted (Cannot allocate memory)
|
1 | {- git-annex benchmark data types.
| ^

aarch64-linux-gnu-gcc: builderMainLoop: fork: resource exhausted (Cannot allocate memory)
|
1 | {- git-annex v7 -> v8 upgrade support
| ^

aarch64-linux-gnu-gcc: builderMainLoop: fork: resource exhausted (Cannot allocate memory)
|
1 | {-# LANGUAGE CPP #-}
| ^

aarch64-linux-gnu-gcc: builderMainLoop: fork: resource exhausted (Cannot allocate memory)
|
1 | {- Running a long or expensive batch operation niced.
| ^

aarch64-linux-gnu-gcc: builderMainLoop: fork: resource exhausted (Cannot allocate memory)
|
1 | {- Interface for running a shell command as a coprocess,
| ^

aarch64-linux-gnu-gcc: builderMainLoop: fork: resource exhausted (Cannot allocate memory)
|
1 | {- daemon support
| ^

aarch64-linux-gnu-gcc: builderMainLoop: fork: resource exhausted (Cannot allocate memory)
|
1 | {- Pinpointing location of MVar/STM deadlocks
| ^

aarch64-linux-gnu-gcc: builderMainLoop: fork: resource exhausted (Cannot allocate memory)
|
1 | {- generic directory watching interface
| ^

aarch64-linux-gnu-gcc: builderMainLoop: fork: resource exhausted (Cannot allocate memory)
|
1 | {- directory traversal and manipulation
| ^

aarch64-linux-gnu-gcc: builderMainLoop: fork: resource exhausted (Cannot allocate memory)
|
1 | {- streaming directory traversal
| ^

aarch64-linux-gnu-gcc: builderMainLoop: fork: resource exhausted (Cannot allocate memory)
|
1 | {- disk free space checking shim
| ^

aarch64-linux-gnu-gcc: builderMainLoop: fork: resource exhausted (Cannot allocate memory)
|
1 | {- portable environment variables
| ^

aarch64-linux-gnu-gcc: builderMainLoop: fork: resource exhausted (Cannot allocate memory)
|
1 | {- portable environment variables
| ^

aarch64-linux-gnu-gcc: builderMainLoop: fork: resource exhausted (Cannot allocate memory)
|
1 | {- File mode utilities.
| ^

aarch64-linux-gnu-gcc: builderMainLoop: fork: resource exhausted (Cannot allocate memory)
|
1 | {- File size.
| ^

aarch64-linux-gnu-gcc: builderMainLoop: fork: resource exhausted (Cannot allocate memory)
|
1 | {- GHC File system encoding handling.
| ^

aarch64-linux-gnu-gcc: builderMainLoop: fork: resource exhausted (Cannot allocate memory)
|
1 | {- file globbing
| ^

aarch64-linux-gnu-gcc: builderMainLoop: fork: resource exhausted (Cannot allocate memory)
|
1 | {- gpg interface
| ^

aarch64-linux-gnu-gcc: builderMainLoop: fork: resource exhausted (Cannot allocate memory)
|
1 | {- Caching a file's inode, size, and modification time
| ^

aarch64-linux-gnu-gcc: builderMainLoop: fork: resource exhausted (Cannot allocate memory)
|
1 | {- Lock files
| ^

aarch64-linux-gnu-gcc: builderMainLoop: fork: resource exhausted (Cannot allocate memory)
|
1 | {- Lock pool.
| ^

aarch64-linux-gnu-gcc: builderMainLoop: fork: resource exhausted (Cannot allocate memory)
|
1 | {- Handles for lock pools.
| ^

aarch64-linux-gnu-gcc: builderMainLoop: fork: resource exhausted (Cannot allocate memory)
|
1 | {- log files
| ^

aarch64-linux-gnu-gcc: builderMainLoop: fork: resource exhausted (Cannot allocate memory)
|
1 | {- moving files
| ^

aarch64-linux-gnu-gcc: builderMainLoop: fork: resource exhausted (Cannot allocate memory)
|
1 | {- process ids
| ^

aarch64-linux-gnu-gcc: builderMainLoop: fork: resource exhausted (Cannot allocate memory)
|
1 | {- path manipulation
| ^

aarch64-linux-gnu-gcc: builderMainLoop: fork: resource exhausted (Cannot allocate memory)
|
1 | {- absolute and relative path manipulation
| ^

aarch64-linux-gnu-gcc: builderMainLoop: fork: resource exhausted (Cannot allocate memory)
|
1 | {- path manipulation
| ^

aarch64-linux-gnu-gcc: builderMainLoop: fork: resource exhausted (Cannot allocate memory)
|
1 | {- Tests for Utility.Path. Split into a separate module to avoid it needing
| ^

aarch64-linux-gnu-gcc: builderMainLoop: fork: resource exhausted (Cannot allocate memory)
|
1 | {- System.Process enhancements, including additional ways of running
| ^

aarch64-linux-gnu-gcc: builderMainLoop: fork: resource exhausted (Cannot allocate memory)
|
1 | {- Process transcript
| ^

aarch64-linux-gnu-gcc: builderMainLoop: fork: resource exhausted (Cannot allocate memory)
|
1 | {- Portability shim for basic operations on RawFilePaths.
| ^

aarch64-linux-gnu-gcc: builderMainLoop: fork: resource exhausted (Cannot allocate memory)
|
1 | {- various rsync stuff
| ^

aarch64-linux-gnu-gcc: builderMainLoop: fork: resource exhausted (Cannot allocate memory)
|
1 | {- /bin/sh handling
| ^

aarch64-linux-gnu-gcc: builderMainLoop: fork: resource exhausted (Cannot allocate memory)
|
1 | {- su to root
| ^

aarch64-linux-gnu-gcc: builderMainLoop: fork: resource exhausted (Cannot allocate memory)
|
1 | {- Transactional lists
| ^

aarch64-linux-gnu-gcc: builderMainLoop: fork: resource exhausted (Cannot allocate memory)
|
1 | {- thread scheduling
| ^

aarch64-linux-gnu-gcc: builderMainLoop: fork: resource exhausted (Cannot allocate memory)
|
1 | {- Temporary files.
| ^

aarch64-linux-gnu-gcc: builderMainLoop: fork: resource exhausted (Cannot allocate memory)
|
1 | {- Temporary directories
| ^

aarch64-linux-gnu-gcc: builderMainLoop: fork: resource exhausted (Cannot allocate memory)
|
1 | {- tor interface
| ^

aarch64-linux-gnu-gcc: builderMainLoop: fork: resource exhausted (Cannot allocate memory)
|
1 | {- Portability shim for touching a file.
| ^

aarch64-linux-gnu-gcc: builderMainLoop: fork: resource exhausted (Cannot allocate memory)
|
1 | {- Url downloading.
| ^

aarch64-linux-gnu-gcc: builderMainLoop: fork: resource exhausted (Cannot allocate memory)
|
1 | {- user info
| ^

aarch64-linux-gnu-gcc: builderMainLoop: fork: resource exhausted (Cannot allocate memory)
|
1 | {- Yesod webapp
| ^

aarch64-linux-gnu-gcc: builderMainLoop: fork: resource exhausted (Cannot allocate memory)
|
1 | {- git-annex assistant daemon
| ^

aarch64-linux-gnu-gcc: builderMainLoop: fork: resource exhausted (Cannot allocate memory)
|
1 | {- git-annex build flags
| ^

aarch64-linux-gnu-gcc: builderMainLoop: fork: resource exhausted (Cannot allocate memory)
|
1 | {- git-annex build info
| ^

aarch64-linux-gnu-gcc: builderMainLoop: fork: resource exhausted (Cannot allocate memory)
|
1 | {- git-annex test suite
| ^

aarch64-linux-gnu-gcc: builderMainLoop: fork: resource exhausted (Cannot allocate memory)
|
1 | {- git-annex upgrade support
| ^

aarch64-linux-gnu-gcc: builderMainLoop: fork: resource exhausted (Cannot allocate memory)
|
1 | {- git-annex main program dispatch
| ^
make[1]: *** [Makefile:58: git-annex] Error 1
make[1]: Leaving directory '/home/builder/gitbuilder/build'
+ exit 3

>>> Result code: 40
FAIL
renamed 'out/log' -> 'out/fail/d424f431169f797d9e9b9e1439fe77865bde1e7c'
Done: d424f431169f797d9e9b9e1439fe77865bde1e7c