<< index

Autobuilder log for tags/8.20210903~44 (e17342b2a023d7de6d1a7ae3e4bc746368ca1b63):

>>> Starting at: Fri Aug 27 19:03:40 BST 2021

>>> Commit: e17342b2a023d7de6d1a7ae3e4bc746368ca1b63

>>> Switching git branch...
--START-IGNORE-WARNINGS
HEAD is now at 16d35e04b Added a comment
Previous HEAD position was 16d35e04b Added a comment
HEAD is now at e17342b2a Run cp -a with --no-preserve=xattr, to avoid problems with copied xattrs
HEAD is now at e17342b2a Run cp -a with --no-preserve=xattr, to avoid problems with copied xattrs
--STOP-IGNORE-WARNINGS

>>> Cleaning...

>>> Building...
+ unset GIT_ANNEX_TMP_BUILD_DIR
+ unset GIT_ANNEX_LOCAL_FEATURES
++ git rev-parse HEAD
+ REV=e17342b2a023d7de6d1a7ae3e4bc746368ca1b63
+ OUTDIR=../out/output/sha1/e17342b2a023d7de6d1a7ae3e4bc746368ca1b63
+ OUTDIR_TMP=../out/output/sha1/e17342b2a023d7de6d1a7ae3e4bc746368ca1b63.tmp
+ install -d -m0755 -- ../out/output/sha1/e17342b2a023d7de6d1a7ae3e4bc746368ca1b63.tmp
+ printf '%s\n' e17342b2a023d7de6d1a7ae3e4bc746368ca1b63
+ ghc --make Build/BuildVersion
Linking Build/BuildVersion ...
+ Build/BuildVersion
+ timeout 60m make linuxstandalone
/bin/make git-annex Build/Standalone
make[1]: Entering directory '/home/builder/gitbuilder/build'
if [ "cabal" = ./Setup ]; then ghc --make Setup; fi
if [ "cabal" != stack ]; then \
cabal configure --ghc-options=""; \
else \
cabal setup ; \
fi
'cabal.project.local' file already exists. Now overwriting it.
Resolving dependencies...
Build profile: -w ghc-8.8.4 -O1
In order, the following would be built (use -v for more details):
- git-annex-8.20210803 (first run)
mkdir -p tmp
touch tmp/configure-stamp
cabal build
Build profile: -w ghc-8.8.4 -O1
In order, the following will be built (use -v for more details):
- git-annex-8.20210803 (exe:git-annex) (first run)
[28 of 29] Compiling Build.Configure ( /home/builder/gitbuilder/build/Build/Configure.hs, /home/builder/gitbuilder/build/dist-newstyle/build/aarch64-linux/ghc-8.8.4/git-annex-8.20210803/setup/Build/Configure.o )
[29 of 29] Compiling Main ( /home/builder/gitbuilder/build/dist-newstyle/build/aarch64-linux/ghc-8.8.4/git-annex-8.20210803/setup/setup.hs, /home/builder/gitbuilder/build/dist-newstyle/build/aarch64-linux/ghc-8.8.4/git-annex-8.20210803/setup/Main.o ) [Build.Configure changed]
Linking /home/builder/gitbuilder/build/dist-newstyle/build/aarch64-linux/ghc-8.8.4/git-annex-8.20210803/setup/setup ...
Preprocessing executable 'git-annex' for git-annex-8.20210803..
Building executable 'git-annex' for git-annex-8.20210803..
[ 6 of 671] Compiling BuildInfo ( BuildInfo.hs, /home/builder/gitbuilder/build/dist-newstyle/build/aarch64-linux/ghc-8.8.4/git-annex-8.20210803/build/git-annex/git-annex-tmp/BuildInfo.o ) [Build/Version changed]
[174 of 671] Compiling Build.Configure ( Build/Configure.hs, /home/builder/gitbuilder/build/dist-newstyle/build/aarch64-linux/ghc-8.8.4/git-annex-8.20210803/build/git-annex/git-annex-tmp/Build/Configure.o )
[175 of 671] Compiling Utility.CopyFile ( Utility/CopyFile.hs, /home/builder/gitbuilder/build/dist-newstyle/build/aarch64-linux/ghc-8.8.4/git-annex-8.20210803/build/git-annex/git-annex-tmp/Utility/CopyFile.o )

Not in scope: `BuildInfo.cp_no_preserve_xattr_supported'
Module `BuildInfo' does not export `cp_no_preserve_xattr_supported'.
|
37 | , (allmeta && BuildInfo.cp_a && BuildInfo.cp_no_preserve_xattr_supported
| ^^^^^^^^^^^^^^^^^^^^^^^^^^^^^^^^^^^^^^^^
make[1]: *** [Makefile:58: git-annex] Error 1
make[1]: Leaving directory '/home/builder/gitbuilder/build'
+ timeout 360m make linuxstandalone
/bin/make git-annex Build/Standalone
make[1]: Entering directory '/home/builder/gitbuilder/build'
cabal build
Build profile: -w ghc-8.8.4 -O1
In order, the following will be built (use -v for more details):
- git-annex-8.20210803 (exe:git-annex) (first run)
Linking /home/builder/gitbuilder/build/dist-newstyle/build/aarch64-linux/ghc-8.8.4/git-annex-8.20210803/setup/setup ...
Preprocessing executable 'git-annex' for git-annex-8.20210803..
Building executable 'git-annex' for git-annex-8.20210803..
[175 of 671] Compiling Utility.CopyFile ( Utility/CopyFile.hs, /home/builder/gitbuilder/build/dist-newstyle/build/aarch64-linux/ghc-8.8.4/git-annex-8.20210803/build/git-annex/git-annex-tmp/Utility/CopyFile.o )

Not in scope: `BuildInfo.cp_no_preserve_xattr_supported'
Module `BuildInfo' does not export `cp_no_preserve_xattr_supported'.
|
37 | , (allmeta && BuildInfo.cp_a && BuildInfo.cp_no_preserve_xattr_supported
| ^^^^^^^^^^^^^^^^^^^^^^^^^^^^^^^^^^^^^^^^
make[1]: *** [Makefile:58: git-annex] Error 1
make[1]: Leaving directory '/home/builder/gitbuilder/build'
+ timeout 360m make linuxstandalone
/bin/make git-annex Build/Standalone
make[1]: Entering directory '/home/builder/gitbuilder/build'
cabal build
Build profile: -w ghc-8.8.4 -O1
In order, the following will be built (use -v for more details):
- git-annex-8.20210803 (exe:git-annex) (first run)
Linking /home/builder/gitbuilder/build/dist-newstyle/build/aarch64-linux/ghc-8.8.4/git-annex-8.20210803/setup/setup ...
Preprocessing executable 'git-annex' for git-annex-8.20210803..
Building executable 'git-annex' for git-annex-8.20210803..
[175 of 671] Compiling Utility.CopyFile ( Utility/CopyFile.hs, /home/builder/gitbuilder/build/dist-newstyle/build/aarch64-linux/ghc-8.8.4/git-annex-8.20210803/build/git-annex/git-annex-tmp/Utility/CopyFile.o )

Not in scope: `BuildInfo.cp_no_preserve_xattr_supported'
Module `BuildInfo' does not export `cp_no_preserve_xattr_supported'.
|
37 | , (allmeta && BuildInfo.cp_a && BuildInfo.cp_no_preserve_xattr_supported
| ^^^^^^^^^^^^^^^^^^^^^^^^^^^^^^^^^^^^^^^^
make[1]: *** [Makefile:58: git-annex] Error 1
make[1]: Leaving directory '/home/builder/gitbuilder/build'
+ timeout 360m make linuxstandalone
/bin/make git-annex Build/Standalone
make[1]: Entering directory '/home/builder/gitbuilder/build'
cabal build
Build profile: -w ghc-8.8.4 -O1
In order, the following will be built (use -v for more details):
- git-annex-8.20210803 (exe:git-annex) (first run)
Linking /home/builder/gitbuilder/build/dist-newstyle/build/aarch64-linux/ghc-8.8.4/git-annex-8.20210803/setup/setup ...
Preprocessing executable 'git-annex' for git-annex-8.20210803..
Building executable 'git-annex' for git-annex-8.20210803..
[175 of 671] Compiling Utility.CopyFile ( Utility/CopyFile.hs, /home/builder/gitbuilder/build/dist-newstyle/build/aarch64-linux/ghc-8.8.4/git-annex-8.20210803/build/git-annex/git-annex-tmp/Utility/CopyFile.o )

Not in scope: `BuildInfo.cp_no_preserve_xattr_supported'
Module `BuildInfo' does not export `cp_no_preserve_xattr_supported'.
|
37 | , (allmeta && BuildInfo.cp_a && BuildInfo.cp_no_preserve_xattr_supported
| ^^^^^^^^^^^^^^^^^^^^^^^^^^^^^^^^^^^^^^^^
make[1]: *** [Makefile:58: git-annex] Error 1
make[1]: Leaving directory '/home/builder/gitbuilder/build'
+ exit 3

>>> Result code: 40
FAIL
renamed 'out/log' -> 'out/fail/e17342b2a023d7de6d1a7ae3e4bc746368ca1b63'
Done: e17342b2a023d7de6d1a7ae3e4bc746368ca1b63